Ethane, 1,1-dibromo-
- Formula: C2H4Br2
- Molecular weight: 187.861
- IUPAC Standard InChIKey: APQIUTYORBAGEZ-UHFFFAOYSA-N
- CAS Registry Number: 557-91-5
- Chemical structure:

Gas phase thermochemistry data

Data compiled by: Hussein Y. Afeefy, Joel F. Liebman, and Stephen E. Stein
Quantity | Value | Units | Method | Reference | Comment |
---|---|---|---|---|---|
ΔfH°gas | -9.8 | kcal/mol | Cm | Kudchadker and Kudchadker, 1979 |

Phase change data

Data compiled as indicated in comments:
BS - Robert L. Brown and Stephen E. Stein
TRC - Thermodynamics Research Center, NIST Boulder Laboratories, Chris Muzny director
Quantity | Value | Units | Method | Reference | Comment |
---|---|---|---|---|---|
Tboil | 381.2 | K | N/A | Weast and Grasselli, 1989 | BS |
Tboil | 382.65 | K | N/A | Lecat, 1947 | Uncertainty assigned by TRC = 0.7 K; TRC |

Reaction thermochemistry data

Data compiled by: Hussein Y. Afeefy, Joel F. Liebman, and Stephen E. Stein
Individual Reactions
By formula: C2H4Br2 = C2H4Br2
Quantity | Value | Units | Method | Reference | Comment |
---|---|---|---|---|---|
ΔrH° | -3.12 ± 0.13 | kcal/mol | Eqk | Izmailov, Rozhnov, et al., 1974 | gas phase |
ΔrH° | 2.90 ± 0.30 | kcal/mol | Eqk | Levanova, Rozhnov, et al., 1970 | gas phase; Heat of isomerization at 484 K |
By formula: 2C2H4BrCl = C2H4Br2 + C2H4Cl2
Quantity | Value | Units | Method | Reference | Comment |
---|---|---|---|---|---|
ΔrH° | 1.9 ± 0.1 | kcal/mol | Eqk | Busheva, Levanova, et al., 1980 | gas phase; Dehydrohalogenation |
By formula: C2H4Br2 = HBr + C2H3Br
Quantity | Value | Units | Method | Reference | Comment |
---|---|---|---|---|---|
ΔrH° | 16.8 ± 0.6 | kcal/mol | Eqk | Levanova, Rozhnov, et al., 1970 | gas phase |

Gas phase ion energetics data

Data compiled as indicated in comments:
LLK - Sharon G. Lias, Rhoda D. Levin, and Sherif A. Kafafi
RDSH - Henry M. Rosenstock, Keith Draxl, Bruce W. Steiner, and John T. Herron
Ionization energy determinations
IE (eV) | Method | Reference | Comment |
---|---|---|---|
10.17 | PE | Berman, Anicich, et al., 1979 | LLK |
10.17 | PI | Berman, Anicich, et al., 1979 | LLK |
10.19 ± 0.03 | PI | Watanabe, Nakayama, et al., 1962 | RDSH |
Appearance energy determinations
Ion | AE (eV) | Other Products | Method | Reference | Comment |
---|---|---|---|---|---|
C2H4Br+ | 10.48 | ? | PI | Berman, Anicich, et al., 1979 | LLK |

Kovats' RI, non-polar column, isothermal

View large format table.

Column type Active phase Temperature (C) I Reference Comment
PackedSqualane27.698.Hively and Hinton, 1968He, Chromosorb P; Column length: 15. m; Column diameter: 0.25 mm
PackedSqualane49.706.Hively and Hinton, 1968He, Chromosorb P; Column length: 15. m; Column diameter: 0.25 mm
PackedSqualane67.712.Hively and Hinton, 1968He, Chromosorb P; Column length: 15. m; Column diameter: 0.25 mm
PackedSqualane86.718.Hively and Hinton, 1968He, Chromosorb P; Column length: 15. m; Column diameter: 0.25 mm

Normal alkane RI, non-polar column, custom temperature program

View large format table.

Column type Active phase I Reference Comment
CapillaryOV-1, SE-30, Methyl silicone, SP-2100, OV-101, DB-1, etc.724.Waggott and Davies, 1984Hydrogen; Column length: 50. m; Column diameter: 0.32 mm; Program: not specified

References

Kudchadker and Kudchadker, 1979
Kudchadker, S.A.; Kudchadker, A.P.,
Ideal gas thermodynamic properties of selected bromoethanes and iodoethane,
J. Phys. Chem. Ref. Data, 1979, 8, 519-526. [all data]
Weast and Grasselli, 1989
CRC Handbook of Data on Organic Compounds, 2nd Editon, Weast,R.C and Grasselli, J.G., ed(s)., CRC Press, Inc., Boca Raton, FL, 1989, 1. [all data]
Lecat, 1947
Lecat, M.,
Some azeotropes of which one constituant is heterocyclic nitrogen,
Ann. Soc. Sci. Bruxelles, Ser. 1, 1947, 61, 73. [all data]
Izmailov, Rozhnov, et al., 1974
Izmailov, V.D.; Rozhnov, A.M.; Sharonov, K.G.,
Equilibrium in the isomerisation of 1,1-dibromoethane and 1,1-dibromopropane,
Russ. J. Phys. Chem. (Engl. Transl.), 1974, 48, 289-290. [all data]
Levanova, Rozhnov, et al., 1970
Levanova, S.V.; Rozhnov, A.M.; Sedov, S.M.; Starkov, V.Ya.; Manzohos, V.N.,
Equilibrium reactions of dibromoethane,
Izv. Vyssh. Uchebn. Zaved., Khim. Khim. Tekhnol., 1970, 13, 62-65. [all data]
Busheva, Levanova, et al., 1980
Busheva, L.I.; Levanova, S.V.; Rodova, R.M.; Rozhnov, A.M.,
Thermocatalytic reactions of 1,1-bromochloroethane,
Russ. J. Phys. Chem. (Engl. Transl.), 1980, 54, 1403-1404. [all data]
Berman, Anicich, et al., 1979
Berman, D.W.; Anicich, V.; Beauchamp, J.L.,
Stabilities of isomeric halonium ions C2H4X+ (X = Cl, Br) by photoionization mass spectrometry iand on cyclotron resonance spectroscopy. General considerations of the relative stabilities of cyclic and acyclic isomeric onium ions,
J. Am. Chem. Soc., 1979, 101, 1239. [all data]
Watanabe, Nakayama, et al., 1962
Watanabe, K.; Nakayama, T.; Mottl, J.,
Ionization potentials of some molecules,
J. Quant. Spectry. Radiative Transfer, 1962, 2, 369. [all data]