Silane,2,4-cyclopentadien-1-yltrifluoro-
- Formula: C5H5F3Si
- Molecular weight: 150.1739
- IUPAC Standard InChIKey: IYAWAHUBSKMVJQ-UHFFFAOYSA-N
- CAS Registry Number: 55765-70-3
- Chemical structure:
View 3d structure (requires JavaScript / HTML 5) - Permanent link for this species. Use this link for bookmarking this species for future reference.

Gas phase ion energetics data

Data compiled by: Sharon G. Lias, Rhoda D. Levin, and Sherif A. Kafafi
Ionization energy determinations
IE (eV) | Method | Reference | Comment |
---|---|---|---|
9.1 | PE | Cradock, Ebsworth, et al., 1975 | Vertical value |

References

Cradock, Ebsworth, et al., 1975
Cradock, S.; Ebsworth, E.A.V.; Moretto, H.; Rankin, D.W.H.,
Photoelectron spectra and fluxional behaviour in some σ-cyclopentadienes,
J. Chem. Soc. Dalton Trans., 1975, 390. [all data]