Tricyclo[9.3.1.14,8]hexadeca-1(15),4,6,8(16),11,13-hexaene,5,12-dimethyl-
- Formula: C18H20
- Molecular weight: 236.3514
- IUPAC Standard InChIKey: YJJVESZXHMGLFK-UHFFFAOYSA-N
- CAS Registry Number: 55705-29-8
- Chemical structure:
View 3d structure (requires JavaScript / HTML 5) - Permanent link for this species. Use this link for bookmarking this species for future reference.

Gas phase ion energetics data

Data compiled by: Sharon G. Lias, Rhoda D. Levin, and Sherif A. Kafafi
Ionization energy determinations
IE (eV) | Method | Reference | Comment |
---|---|---|---|
7.98 | PE | Koenig, Tuttle, et al., 1974 | Vertical value |

References

Koenig, Tuttle, et al., 1974
Koenig, T.; Tuttle, M.; Wielesek, R.A.,
The He(I) photoelectron spectra of xylenes and metacyclophanes. A reassignment of the lowest ionic state of [2.2] metacyclophane,
Tetrahedron Lett., 1974, 2537. [all data]