2(1H)-Pyrimidinone
- Formula: C4H4N2O
- Molecular weight: 96.0874
- IUPAC Standard InChIKey: VTGOHKSTWXHQJK-UHFFFAOYSA-N
- CAS Registry Number: 557-01-7
- Chemical structure:
View 3d structure (requires JavaScript / HTML 5) - Other names: 1H-pyrimidin-2-one

Gas phase ion energetics data

Data evaluated as indicated in comments:
HL - Edward P. Hunter and Sharon G. Lias
Data compiled as indicated in comments:
LLK - Sharon G. Lias, Rhoda D. Levin, and Sherif A. Kafafi
Quantity | Value | Units | Method | Reference | Comment |
---|---|---|---|---|---|
Proton affinity (review) | 872.7 | kJ/mol | N/A | Hunter and Lias, 1998 | HL |
Quantity | Value | Units | Method | Reference | Comment |
Gas basicity | 841.7 | kJ/mol | N/A | Hunter and Lias, 1998 | HL |
Ionization energy determinations
IE (eV) | Method | Reference | Comment |
---|---|---|---|
10.06 ± 0.05 | EI | Gacek, Thorstad, et al., 1978 | LLK |

References

Hunter and Lias, 1998
Hunter, E.P.; Lias, S.G.,
Evaluated Gas Phase Basicities and Proton Affinities of Molecules: An Update,
J. Phys. Chem. Ref. Data, 1998, 27, 3, 413-656, https://doi.org/10.1063/1.556018
. [all data]
Gacek, Thorstad, et al., 1978
Gacek, M.; Thorstad, O.; Ongstad, L.; Undheim, K.,
Ionisation potentials in tautomer analysis of 2-hydroxypyrimidines,
Chem. Scr., 1978, 13, 99. [all data]