Ethanamine, 2-methoxy-N,N-dimethyl-, N-oxide
- Formula: C5H13NO2
- Molecular weight: 119.1622
- IUPAC Standard InChIKey: BNDGMJRXNIIURI-UHFFFAOYSA-N
- CAS Registry Number: 55695-37-9
- Chemical structure:
View 3d structure (requires JavaScript / HTML 5) - Permanent link for this species. Use this link for bookmarking this species for future reference.

Gas phase ion energetics data

Data compiled by: Sharon G. Lias, Rhoda D. Levin, and Sherif A. Kafafi
Ionization energy determinations
IE (eV) | Method | Reference | Comment |
---|---|---|---|
8.37 | PE | Wieczorek, Koenig, et al., 1975 | Vertical value |

References

Wieczorek, Koenig, et al., 1975
Wieczorek, J.S.; Koenig, T.; Balle, T.,
The He(I) photoelectron spectra of amine n-oxides,
J. Electron Spectrosc. Relat. Phenom., 1975, 6, 215. [all data]