2-Amino-3-(4-hydroxyphenyl)-propanoic acid
- Formula: C9H11NO3
- Molecular weight: 181.1885
- IUPAC Standard InChIKey: OUYCCCASQSFEME-UHFFFAOYSA-N
- CAS Registry Number: 556-03-6
- Chemical structure:
- Stereoisomers:
- Other names: DL-Tyrosine; (.+/-.)-Tyrosine; Tyrosine, DL-

Reaction thermochemistry data

Data compiled by: Robert C. Dunbar
Individual Reactions
By formula: Na+ + C9H11NO3 = (Na+ • C9H11NO3)
Quantity | Value | Units | Method | Reference | Comment |
---|---|---|---|---|---|
ΔrH° | 48.0 | kcal/mol | CIDC | Kish, Ohanessian, et al., 2003 | Anchor alanine=39.89 |

Gas phase ion energetics data

Data compiled as indicated in comments:
LBLHLM - Sharon G. Lias, John E. Bartmess, Joel F. Liebman, John L. Holmes, Rhoda D. Levin, and W. Gary Mallard
RDSH - Henry M. Rosenstock, Keith Draxl, Bruce W. Steiner, and John T. Herron
Ionization energy determinations
IE (eV) | Method | Reference | Comment |
---|---|---|---|
8.0 | PE | Cannington and Ham, 1983 | LBLHLM |
≤8.4 | EI | Akopyan and Loginov, 1967 | RDSH |
8.5 | PE | Cannington and Ham, 1983 | Vertical value; LBLHLM |

Ion clustering data

Data compiled by: Robert C. Dunbar
Clustering reactions
By formula: Na+ + C9H11NO3 = (Na+ • C9H11NO3)
Quantity | Value | Units | Method | Reference | Comment |
---|---|---|---|---|---|
ΔrH° | 48.0 | kcal/mol | CIDC | Kish, Ohanessian, et al., 2003 | Anchor alanine=39.89 |

References

Kish, Ohanessian, et al., 2003
Kish, M.M.; Ohanessian, G.; Wesdemiotis, C.,
The Na+ affinities of a-amino acids: side-chain substituent effects,
Int. J. Mass Spectrom., 2003, 227, 3, 509, https://doi.org/10.1016/S1387-3806(03)00082-4
. [all data]
Cannington and Ham, 1983
Cannington, P.H.; Ham, N.S.,
He(I) and He(II) photoelectron spectra of glycine and related molecules,
J. Electron Spectrosc. Relat. Phenom., 1983, 32, 139. [all data]
Akopyan and Loginov, 1967
Akopyan, M.E.; Loginov, Yy.V.,
Mass-spectrometric study of the phoionization of free α-aminoacids,
High Energy Chem., 1967, 1, 83, In original 97. [all data]