Benzeneacetonitrile, 4-nitro-
- Formula: C8H6N2O2
- Molecular weight: 162.1454
- IUPAC Standard InChIKey: PXNJGLAVKOXITN-UHFFFAOYSA-N
- CAS Registry Number: 555-21-5
- Chemical structure:
View 3d structure (requires JavaScript / HTML 5) - Other names: Acetonitrile, (p-nitrophenyl)-; (p-Nitrobenzene)acetonitrile; (p-Nitrophenyl)acetonitrile; p-Nitro-α-tolunitrile; p-Nitrobenzyl cyanide; 4-Nitrobenzeneacetonitrile; 4-Nitrobenzyl cyanide; 4-Nitrophenylacetonitrile; 4-Nitrobenzyl nitrile; NSC 5396

Reaction thermochemistry data

Data compiled by: John E. Bartmess
Individual Reactions
C8H5N2O2- + =
By formula: C8H5N2O2- + H+ = C8H6N2O2
Quantity | Value | Units | Method | Reference | Comment |
---|---|---|---|---|---|
ΔrH° | 1378. ± 9.6 | kJ/mol | G+TS | Fujio, McIver, et al., 1981 | gas phase; value altered from reference due to change in acidity scale |
Quantity | Value | Units | Method | Reference | Comment |
ΔrG° | 1350. ± 8.4 | kJ/mol | IMRE | Fujio, McIver, et al., 1981 | gas phase; value altered from reference due to change in acidity scale |

Gas phase ion energetics data

Data compiled as indicated in comments:
B - John E. Bartmess
RDSH - Henry M. Rosenstock, Keith Draxl, Bruce W. Steiner, and John T. Herron
Ionization energy determinations
IE (eV) | Method | Reference | Comment |
---|---|---|---|
10.11 ± 0.04 | EI | Buchs, 1970 | RDSH |
De-protonation reactions
C8H5N2O2- + =
By formula: C8H5N2O2- + H+ = C8H6N2O2
Quantity | Value | Units | Method | Reference | Comment |
---|---|---|---|---|---|
ΔrH° | 1378. ± 9.6 | kJ/mol | G+TS | Fujio, McIver, et al., 1981 | gas phase; value altered from reference due to change in acidity scale; B |
Quantity | Value | Units | Method | Reference | Comment |
ΔrG° | 1350. ± 8.4 | kJ/mol | IMRE | Fujio, McIver, et al., 1981 | gas phase; value altered from reference due to change in acidity scale; B |

References

Fujio, McIver, et al., 1981
Fujio, M.; McIver, R.T., Jr.; Taft, R.W.,
Effects on the acidities of phenols from specific substituent-solvent interactions. Inherent substituent parameters from gas phase acidities,
J. Am. Chem. Soc., 1981, 103, 4017. [all data]
Buchs, 1970
Buchs, A.,
Etude par spectrometrie de masse de l'ionisation de benzonitriles, de phenylacetonitriles et de N,N-dimethylanilines substitues,
Helv. Chim. Acta, 1970, 53, 2026. [all data]