Benzaldehyde, 4-nitro-
- Formula: C7H5NO3
- Molecular weight: 151.1195
- IUPAC Standard InChIKey: BXRFQSNOROATLV-UHFFFAOYSA-N
- CAS Registry Number: 555-16-8
- Chemical structure:
View 3d structure (requires JavaScript / HTML 5) - Other names: Benzaldehyde, p-nitro-; p-Formylnitrobenzene; p-Nitrobenzaldehyde; 4-Nitrobenzaldehyde

Condensed phase thermochemistry data

Data compiled by: Hussein Y. Afeefy, Joel F. Liebman, and Stephen E. Stein
Quantity | Value | Units | Method | Reference | Comment |
---|---|---|---|---|---|
ΔfH°solid | -151. | kJ/mol | Ccb | Zavoianu, Contineanu, et al., 1987 | |
ΔfH°solid | -152.7 | kJ/mol | Ccb | Rinkenbach, 1930 | Author hf298_condensed[kcal/mol]=-44.14 |
Quantity | Value | Units | Method | Reference | Comment |
ΔcH°solid | -3318. | kJ/mol | Ccb | Zavoianu, Contineanu, et al., 1987 | |
ΔcH°solid | -3316.49 | kJ/mol | Ccb | Rinkenbach, 1930 | Author hf298_condensed[kcal/mol]=-44.14 |

Phase change data

Data compiled by: Thermodynamics Research Center, NIST Boulder Laboratories, Chris Muzny director
Quantity | Value | Units | Method | Reference | Comment |
---|---|---|---|---|---|
Tfus | 377.15 | K | N/A | Hajos, 1959 | Uncertainty assigned by TRC = 2. K |
Tfus | 375.15 | K | N/A | Hajos, 1959 | Uncertainty assigned by TRC = 2.5 K |
Tfus | 380. | K | N/A | Timmermans, 1935 | Uncertainty assigned by TRC = 2. K |

Gas phase ion energetics data

Data evaluated as indicated in comments:
HL - Edward P. Hunter and Sharon G. Lias
Data compiled as indicated in comments:
LBLHLM - Sharon G. Lias, John E. Bartmess, Joel F. Liebman, John L. Holmes, Rhoda D. Levin, and W. Gary Mallard
RDSH - Henry M. Rosenstock, Keith Draxl, Bruce W. Steiner, and John T. Herron
B - John E. Bartmess
Quantity | Value | Units | Method | Reference | Comment |
---|---|---|---|---|---|
Proton affinity (review) | 795.1 | kJ/mol | N/A | Hunter and Lias, 1998 | HL |
Quantity | Value | Units | Method | Reference | Comment |
Gas basicity | 763.2 | kJ/mol | N/A | Hunter and Lias, 1998 | HL |
Electron affinity determinations
EA (eV) | Method | Reference | Comment |
---|---|---|---|
1.691 ± 0.087 | IMRE | Chowdhury, Kishi, et al., 1989 | ΔGea(423 K) = -37.7 kcal/mol, ΔS = -3 eu est.; B |
1.652 ± 0.087 | IMRE | Huh, Kang, et al., 1999 | ΔG(EA) 343K; anchored to ΔG value. Including anchor ΔS, EA is ca. 0.4 kcal/mol more bound.; B |
1.635 ± 0.087 | IMRE | Mishima, Huh, et al., 1993 | ΔGea(343 K)=-29.4 kcal/mol. Reanchored to EA(PhNO2), Kebarle and Chowdhury, 1987.; B |
Ionization energy determinations
IE (eV) | Method | Reference | Comment |
---|---|---|---|
10.27 ± 0.01 | PE | Gal, Geribaldi, et al., 1985 | LBLHLM |
10.27 ± 0.01 | EI | Foffani, Pignataro, et al., 1964 | RDSH |
10.37 | PE | Gal, Geribaldi, et al., 1985 | Vertical value; LBLHLM |

Kovats' RI, non-polar column, isothermal

View large format table.

Column type Active phase Temperature (C) I Reference Comment
PackedOV-101140.1291.8Righezza, Hassani, et al., 1996N2, Chromosorb G HP; Column length: 5. m
PackedOV-101160.1302.2Hassani and Meklati, 1992N2, Chromosorb G HP; Column length: 5. m

References

Zavoianu, Contineanu, et al., 1987
Zavoianu, D.; Contineanu, I.; Moga-Gheorghe, S.; Marchidan, D.I.,
Structure and reactivity of nitriles. II. Condensing reactions of methyl and dimethylphenylacetonitriles with substituted aromatic aldehydes,
Rev. Chim. (Bucharest), 1987, 38, 9-15. [all data]
Rinkenbach, 1930
Rinkenbach, W.H.,
The heats of combustion and formation of aromatic nitro compounds,
J. Am. Chem. Soc., 1930, 52, 115-120. [all data]
Hajos, 1959
Hajos, A.,
Experiments in the Domain of chloroamphenicols VIII. Preparation of nitroacetophenones and nitrobenzaldehydes and various derivatives through oxidative oxime cleavage,
Acta Chim. Acad. Sci. Hung., 1959, 21, 131. [all data]
Timmermans, 1935
Timmermans, J.,
Researches in Stoichiometry. I. The Heat of Fusion of Organic Compounds.,
Bull. Soc. Chim. Belg., 1935, 44, 17-40. [all data]
Hunter and Lias, 1998
Hunter, E.P.; Lias, S.G.,
Evaluated Gas Phase Basicities and Proton Affinities of Molecules: An Update,
J. Phys. Chem. Ref. Data, 1998, 27, 3, 413-656, https://doi.org/10.1063/1.556018
. [all data]
Chowdhury, Kishi, et al., 1989
Chowdhury, S.; Kishi, H.; Dillow, G.W.; Kebarle, P.,
Electron Affinities of Substituted Nitrobenzenes,
Can. J. Chem., 1989, 67, 4, 603, https://doi.org/10.1139/v89-091
. [all data]
Huh, Kang, et al., 1999
Huh, C.; Kang, C.H.; Lee, H.W.; Nakamura, H.; Mishima, M.; Tsuno, Y.; Yamataka, H.,
Thermodynamic stabilities and resonance demand of aromatic radical anions in the gas phase,
Bull. Chem. Soc. Japan, 1999, 72, 5, 1083-1091, https://doi.org/10.1246/bcsj.72.1083
. [all data]
Mishima, Huh, et al., 1993
Mishima, M.; Huh, C.; Nakamura, H.; Fujio, M.; Tsuno, Y.,
Electron Affinities of Benzaldehydes. Substituent Effects on Stabilities of Aromatic Radical Anions.,
Tetrahed. Lett., 1993, 34, 26, 4223, https://doi.org/10.1016/S0040-4039(00)60533-6
. [all data]
Kebarle and Chowdhury, 1987
Kebarle, P.; Chowdhury, S.,
Electron affinities and electron transfer reactions,
Chem. Rev., 1987, 87, 513. [all data]
Gal, Geribaldi, et al., 1985
Gal, J.-F.; Geribaldi, S.; Pfister-Guillouzo, G.; Morris, D.G.,
Basicity of the carbonyl group. Part 12. Correlations between ionization potentials and lewis basicities in aromatic carbonyl compounds,
J. Chem. Soc. Perkin Trans. 2, 1985, 103. [all data]
Foffani, Pignataro, et al., 1964
Foffani, A.; Pignataro, S.; Cantone, B.; Grasso, F.,
Ionization potentials and substituent effects for aromatic carbonyl compounds,
Z. Physik. Chem. (Frankfurt), 1964, 42, 221. [all data]