Indeno[1,2-d]triazol-8(3H)-one,3a,8a-dihydro-3-methyl-
- Formula: C10H9N3O
- Molecular weight: 187.1980
- IUPAC Standard InChIKey: NIFOIZFYRHNMPW-UHFFFAOYSA-N
- CAS Registry Number: 55507-30-7
- Chemical structure:
View 3d structure (requires JavaScript / HTML 5) - Permanent link for this species. Use this link for bookmarking this species for future reference.

Gas phase ion energetics data

Data compiled by: Sharon G. Lias, Rhoda D. Levin, and Sherif A. Kafafi
Appearance energy determinations
Ion | AE (eV) | Other Products | Method | Reference | Comment |
---|---|---|---|---|---|
C10H9NO+ | 8.8 ± 0.2 | N2 | EI | Hansen and Undheim, 1975 |

References

Hansen and Undheim, 1975
Hansen, P.E.; Undheim, K.,
Mass spectrometry of onium compounds. XXIX. Ionisation potential in structure analysis of valence isomers,
Acta Chem. Scand., Ser. B, 1975, 29, 221. [all data]