Indeno[1,2-d]triazol-8(3H)-one,3a,8a-dihydro-3-phenyl-
- Formula: C15H11N3O
- Molecular weight: 249.2673
- IUPAC Standard InChIKey: WSRGQSQQOPQCPH-UHFFFAOYSA-N
- CAS Registry Number: 55507-27-2
- Chemical structure:
View 3d structure (requires JavaScript / HTML 5) - Permanent link for this species. Use this link for bookmarking this species for future reference.

Gas phase ion energetics data

Data compiled by: Sharon G. Lias, Rhoda D. Levin, and Sherif A. Kafafi
Appearance energy determinations
Ion | AE (eV) | Other Products | Method | Reference | Comment |
---|---|---|---|---|---|
C15H11NO+ | 8.1 ± 0.1 | N2 | EI | Hansen and Undheim, 1975 |

References

Hansen and Undheim, 1975
Hansen, P.E.; Undheim, K.,
Mass spectrometry of onium compounds. XXIX. Ionisation potential in structure analysis of valence isomers,
Acta Chem. Scand., Ser. B, 1975, 29, 221. [all data]