Phenol, 3-nitro-
- Formula: C6H5NO3
- Molecular weight: 139.1088
- IUPAC Standard InChIKey: RTZZCYNQPHTPPL-UHFFFAOYSA-N
- CAS Registry Number: 554-84-7
- Chemical structure:
View 3d structure (requires JavaScript / HTML 5) - Other names: Phenol, m-nitro-; m-Nitrophenol; m-Hydroxynitrobenzene; 3-Hydroxynitrobenzene; 3-Nitrophenol; m-Nitrofenol; meta-Nitrophenol; 1-Hydroxy-3-nitrobenzene; NSC 1551

Gas phase thermochemistry data

Data compiled by: Hussein Y. Afeefy, Joel F. Liebman, and Stephen E. Stein
Quantity | Value | Units | Method | Reference | Comment |
---|---|---|---|---|---|
ΔfH°gas | -109.3 ± 1.1 | kJ/mol | Ccr | Sabbah and Gouali, 1994 | Author was aware that data differs from previously reported values |
ΔfH°gas | -105.5 ± 1.8 | kJ/mol | Ccb | Ribeiro Da Silva, Reis, et al., 1992 |

Condensed phase thermochemistry data

Data compiled by: Hussein Y. Afeefy, Joel F. Liebman, and Stephen E. Stein
Quantity | Value | Units | Method | Reference | Comment |
---|---|---|---|---|---|
ΔfH°solid | -200.5 ± 1.0 | kJ/mol | Ccr | Sabbah and Gouali, 1994 | Author was aware that data differs from previously reported values |
ΔfH°solid | -205.7 ± 1.7 | kJ/mol | Ccb | Ribeiro Da Silva, Reis, et al., 1992 | |
ΔfH°solid | -225. | kJ/mol | Ccb | Swarts, 1914 | See 14SWA2 |
Quantity | Value | Units | Method | Reference | Comment |
ΔcH°solid | -2875.1 ± 0.9 | kJ/mol | Ccr | Sabbah and Gouali, 1994 | Author was aware that data differs from previously reported values |
ΔcH°solid | -2870.0 ± 1.5 | kJ/mol | Ccb | Ribeiro Da Silva, Reis, et al., 1992 | |
ΔcH°solid | -2880. | kJ/mol | Ccb | Swarts, 1914 | See 14SWA2 |

Phase change data

Data compiled as indicated in comments:
BS - Robert L. Brown and Stephen E. Stein
TRC - Thermodynamics Research Center, NIST Boulder Laboratories, Chris Muzny director
AC - William E. Acree, Jr., James S. Chickos
ALS - Hussein Y. Afeefy, Joel F. Liebman, and Stephen E. Stein
DH - Eugene S. Domalski and Elizabeth D. Hearing
Quantity | Value | Units | Method | Reference | Comment |
---|---|---|---|---|---|
Tfus | 368. ± 4. | K | AVG | N/A | Average of 7 values; Individual data points |
Quantity | Value | Units | Method | Reference | Comment |
ΔvapH° | 85.9 | kJ/mol | B | Heintz, Kapteina, et al., 2007 | AC |
Quantity | Value | Units | Method | Reference | Comment |
ΔsubH° | 91.23 ± 0.49 | kJ/mol | C | Sabbah and Gouali, 1994 | Author was aware that data differs from previously reported values; ALS |
ΔsubH° | 91.2 ± 0.5 | kJ/mol | C | Sabbah and Gouali, 1994, 2 | AC |
ΔsubH° | 100.2 ± 0.6 | kJ/mol | V | Ribeiro Da Silva, Reis, et al., 1992 | ALS |
ΔsubH° | 100.2 ± 0.6 | kJ/mol | N/A | Ribeiro Da Silva, Reis, et al., 1992 | AC |
Reduced pressure boiling point
Tboil (K) | Pressure (bar) | Reference | Comment |
---|---|---|---|
467.2 | 0.093 | Weast and Grasselli, 1989 | BS |
Enthalpy of sublimation
ΔsubH (kJ/mol) | Temperature (K) | Method | Reference | Comment |
---|---|---|---|---|
98.5 ± 0.6 | 321. | ME | Ribeiro Da Silva, Reis, et al., 1992 | AC |
76.2 | 319.5 | A | Stephenson and Malanowski, 1987 | Based on data from 305. to 334. K.; AC |
92. ± 2. | 328. | V | Wolf and Weghofer, 1938 | ALS |
91.6 ± 1.7 | 325. to 336. | N/A | Trieschmann, 1935 | See also Wolf and Weghofer, 1938, 2 and Jones, 1960.; AC |
Enthalpy of fusion
ΔfusH (kJ/mol) | Temperature (K) | Reference | Comment |
---|---|---|---|
19.196 | 370.0 | Poeti, Fanelli, et al., 1982 | DH |
18.06 | 369. | Musuc, Razus, et al., 2002 | AC |
19.19 | 371.2 | Acree, 1991 | See also Sabbah and Gouali, 1994, 2.; AC |
19.2 | 370. | Poeti, Fanelli, et al., 1982 | AC |
21.300 | 369.95 | Booss and Hauschildt, 1972 | DH |
Entropy of fusion
ΔfusS (J/mol*K) | Temperature (K) | Reference | Comment |
---|---|---|---|
51.88 | 370.0 | Poeti, Fanelli, et al., 1982 | DH |
57.6 | 369.95 | Booss and Hauschildt, 1972 | DH |
Enthalpy of phase transition
ΔHtrs (kJ/mol) | Temperature (K) | Initial Phase | Final Phase | Reference | Comment |
---|---|---|---|---|---|
0.167 | 356. | crystaline, II | crystaline, I | Wojcik and Marqueton, 1989 | DH |
19.960 | 370. | crystaline, I | liquid | Wojcik and Marqueton, 1989 | DH |
Entropy of phase transition
ΔStrs (J/mol*K) | Temperature (K) | Initial Phase | Final Phase | Reference | Comment |
---|---|---|---|---|---|
0.47 | 356. | crystaline, II | crystaline, I | Wojcik and Marqueton, 1989 | DH |
54. | 370. | crystaline, I | liquid | Wojcik and Marqueton, 1989 | DH |

Reaction thermochemistry data

Data compiled as indicated in comments:
B - John E. Bartmess
M - Michael M. Meot-Ner (Mautner) and Sharon G. Lias
Individual Reactions
By formula: Br- + C6H5NO3 = (Br- • C6H5NO3)
Quantity | Value | Units | Method | Reference | Comment |
---|---|---|---|---|---|
ΔrH° | 115. ± 7.5 | kJ/mol | IMRE | Paul and Kebarle, 1990 | gas phase; ΔGaff at 423 K; B,M |
Quantity | Value | Units | Method | Reference | Comment |
ΔrS° | 96. | J/mol*K | N/A | Paul and Kebarle, 1990 | gas phase; switching reaction,Thermochemical ladder(Br-)C6H5OH, Entropy change calculated or estimated; M |
Quantity | Value | Units | Method | Reference | Comment |
ΔrG° | 74.1 ± 4.2 | kJ/mol | IMRE | Paul and Kebarle, 1990 | gas phase; ΔGaff at 423 K; B |
Free energy of reaction
ΔrG° (kJ/mol) | T (K) | Method | Reference | Comment |
---|---|---|---|---|
74.1 | 423. | PHPMS | Paul and Kebarle, 1990 | gas phase; switching reaction,Thermochemical ladder(Br-)C6H5OH, Entropy change calculated or estimated; M |
By formula: I- + C6H5NO3 = (I- • C6H5NO3)
Quantity | Value | Units | Method | Reference | Comment |
---|---|---|---|---|---|
ΔrH° | 97.1 ± 7.5 | kJ/mol | IMRE | Paul and Kebarle, 1990 | gas phase; ΔGaff at 423 K; B,M |
Quantity | Value | Units | Method | Reference | Comment |
ΔrS° | 88. | J/mol*K | N/A | Paul and Kebarle, 1990 | gas phase; Entropy change calculated or estimated; M |
Quantity | Value | Units | Method | Reference | Comment |
ΔrG° | 59.8 ± 4.2 | kJ/mol | IMRE | Paul and Kebarle, 1990 | gas phase; ΔGaff at 423 K; B |
Free energy of reaction
ΔrG° (kJ/mol) | T (K) | Method | Reference | Comment |
---|---|---|---|---|
59.8 | 423. | PHPMS | Paul and Kebarle, 1990 | gas phase; Entropy change calculated or estimated; M |
C6H4NO3- + =
By formula: C6H4NO3- + H+ = C6H5NO3
Quantity | Value | Units | Method | Reference | Comment |
---|---|---|---|---|---|
ΔrH° | 1399. ± 8.8 | kJ/mol | G+TS | Fujio, McIver, et al., 1981 | gas phase; value altered from reference due to change in acidity scale; B |
ΔrH° | 1400. ± 11. | kJ/mol | G+TS | Kebarle and McMahon, 1977 | gas phase; B |
Quantity | Value | Units | Method | Reference | Comment |
ΔrG° | 1370. ± 8.4 | kJ/mol | IMRE | Fujio, McIver, et al., 1981 | gas phase; value altered from reference due to change in acidity scale; B |
ΔrG° | 1371. ± 8.4 | kJ/mol | IMRE | Kebarle and McMahon, 1977 | gas phase; B |

Henry's Law data

Data compiled by: Rolf Sander
Henry's Law constant (water solution)
kH(T) = k°H exp(d(ln(kH))/d(1/T) ((1/T) - 1/(298.15 K)))
k°H = Henry's law constant for solubility in water at 298.15 K (mol/(kg*bar))
d(ln(kH))/d(1/T) = Temperature dependence constant (K)
k°H (mol/(kg*bar)) | d(ln(kH))/d(1/T) (K) | Method | Reference | Comment |
---|---|---|---|---|
500000. | X | N/A | Value given here as quoted by missing citation. |

Gas phase ion energetics data

Data compiled as indicated in comments:
B - John E. Bartmess
LLK - Sharon G. Lias, Rhoda D. Levin, and Sherif A. Kafafi
RDSH - Henry M. Rosenstock, Keith Draxl, Bruce W. Steiner, and John T. Herron
Ionization energy determinations
IE (eV) | Method | Reference | Comment |
---|---|---|---|
9.0 | PE | Kobayashi and Nagakura, 1975 | LLK |
9.33 | PE | Kobayashi and Nagakura, 1975 | Vertical value; LLK |
Appearance energy determinations
Ion | AE (eV) | Other Products | Method | Reference | Comment |
---|---|---|---|---|---|
NO+ | 10.5 ± 0.2 | ? | EI | Beynon, Hopkinson, et al., 1969 | RDSH |
De-protonation reactions
C6H4NO3- + =
By formula: C6H4NO3- + H+ = C6H5NO3
Quantity | Value | Units | Method | Reference | Comment |
---|---|---|---|---|---|
ΔrH° | 1399. ± 8.8 | kJ/mol | G+TS | Fujio, McIver, et al., 1981 | gas phase; value altered from reference due to change in acidity scale; B |
ΔrH° | 1400. ± 11. | kJ/mol | G+TS | Kebarle and McMahon, 1977 | gas phase; B |
Quantity | Value | Units | Method | Reference | Comment |
ΔrG° | 1370. ± 8.4 | kJ/mol | IMRE | Fujio, McIver, et al., 1981 | gas phase; value altered from reference due to change in acidity scale; B |
ΔrG° | 1371. ± 8.4 | kJ/mol | IMRE | Kebarle and McMahon, 1977 | gas phase; B |

Ion clustering data

Data compiled as indicated in comments:
B - John E. Bartmess
M - Michael M. Meot-Ner (Mautner) and Sharon G. Lias
Clustering reactions
By formula: Br- + C6H5NO3 = (Br- • C6H5NO3)
Quantity | Value | Units | Method | Reference | Comment |
---|---|---|---|---|---|
ΔrH° | 115. ± 7.5 | kJ/mol | IMRE | Paul and Kebarle, 1990 | gas phase; ΔGaff at 423 K; B,M |
Quantity | Value | Units | Method | Reference | Comment |
ΔrS° | 96. | J/mol*K | N/A | Paul and Kebarle, 1990 | gas phase; switching reaction,Thermochemical ladder(Br-)C6H5OH, Entropy change calculated or estimated; M |
Quantity | Value | Units | Method | Reference | Comment |
ΔrG° | 74.1 ± 4.2 | kJ/mol | IMRE | Paul and Kebarle, 1990 | gas phase; ΔGaff at 423 K; B |
Free energy of reaction
ΔrG° (kJ/mol) | T (K) | Method | Reference | Comment |
---|---|---|---|---|
74.1 | 423. | PHPMS | Paul and Kebarle, 1990 | gas phase; switching reaction,Thermochemical ladder(Br-)C6H5OH, Entropy change calculated or estimated; M |
By formula: I- + C6H5NO3 = (I- • C6H5NO3)
Quantity | Value | Units | Method | Reference | Comment |
---|---|---|---|---|---|
ΔrH° | 97.1 ± 7.5 | kJ/mol | IMRE | Paul and Kebarle, 1990 | gas phase; ΔGaff at 423 K; B,M |
Quantity | Value | Units | Method | Reference | Comment |
ΔrS° | 88. | J/mol*K | N/A | Paul and Kebarle, 1990 | gas phase; Entropy change calculated or estimated; M |
Quantity | Value | Units | Method | Reference | Comment |
ΔrG° | 59.8 ± 4.2 | kJ/mol | IMRE | Paul and Kebarle, 1990 | gas phase; ΔGaff at 423 K; B |
Free energy of reaction
ΔrG° (kJ/mol) | T (K) | Method | Reference | Comment |
---|---|---|---|---|
59.8 | 423. | PHPMS | Paul and Kebarle, 1990 | gas phase; Entropy change calculated or estimated; M |

Kovats' RI, non-polar column, isothermal

Column type | Active phase | Temperature (C) | I | Reference | Comment |
---|---|---|---|---|---|
Packed | Apiezon L | 204. | 1514. | Mitchell and Vernon, 1972 | |
Packed | SE-52 | 204. | 1530. | Mitchell and Vernon, 1972 |

Van Den Dool and Kratz RI, non-polar column, custom temperature program

Column type | Active phase | I | Reference | Comment |
---|---|---|---|---|
Capillary | VF-5MS | 1484.6 | Tret'yakov, 2007 | 30. m/0.25 mm/0.25 μm, He; Program: Multi-step temperature program; T(initial)=60C; T(final)=270C |

References

Sabbah and Gouali, 1994
Sabbah, R.; Gouali, M.,
Energetics of intra- and inter-molecular bonds in the three nitrophenols,
Aust. J. Chem., 1994, 47, 1651-1660. [all data]
Ribeiro Da Silva, Reis, et al., 1992
Ribeiro Da Silva, M.A.V.; Reis, A.M.M.V.; Monte, M.J.S.; Bartolo, M.M.S.S.F.; Rodrigues, J.A.R.G.O.,
Enthalpy of combustion, vapour pressures, and enthalpy of sublimation of 3-nitrophenol,
J. Chem. Thermodyn., 1992, 24, 653-659. [all data]
Swarts, 1914
Swarts, F.,
Sur la chaleur de combustion de quelques derives nitres aromatlques,
Recl. Trav. Chim. Pays-Bas, 1914, 33, 281-298. [all data]
Heintz, Kapteina, et al., 2007
Heintz, A.; Kapteina, S.; Verevkin, S.P.,
Pairwise-Substitution Effects and Intramolecular Hydrogen Bonds in Nitrophenols and Methylnitrophenols. Thermochemical Measurements and ab Initio Calculations,
J. Phys. Chem. A, 2007, 111, 28, 6552-6562, https://doi.org/10.1021/jp0730388
. [all data]
Sabbah and Gouali, 1994, 2
Sabbah, R.; Gouali, M.,
Energetics of Intra- and Inter-molecular Bonds in the Three Nitrophenols,
Aust. J. Chem., 1994, 47, 9, 1651-621, https://doi.org/10.1071/CH9941651
. [all data]
Weast and Grasselli, 1989
CRC Handbook of Data on Organic Compounds, 2nd Editon, Weast,R.C and Grasselli, J.G., ed(s)., CRC Press, Inc., Boca Raton, FL, 1989, 1. [all data]
Stephenson and Malanowski, 1987
Stephenson, Richard M.; Malanowski, Stanislaw,
Handbook of the Thermodynamics of Organic Compounds, 1987, https://doi.org/10.1007/978-94-009-3173-2
. [all data]
Wolf and Weghofer, 1938
Wolf, K.L.; Weghofer, H.,
Uber sublimationswarmen,
Z. Phys. Chem., 1938, 39, 194-208. [all data]
Trieschmann, 1935
Trieschmann, H.G.,
, Ph.D. Dissertation, Inst. Fur Phys. Chem. and Electrochem. der Universitat Kiel, Germany, 1935. [all data]
Wolf and Weghofer, 1938, 2
Wolf, K.L.; Weghofer, H.Z.,
Z. Phys. Chem. Abt. B, 1938, 39, 194. [all data]
Jones, 1960
Jones, A.H.,
Sublimation Pressure Data for Organic Compounds.,
J. Chem. Eng. Data, 1960, 5, 2, 196-200, https://doi.org/10.1021/je60006a019
. [all data]
Poeti, Fanelli, et al., 1982
Poeti, G.; Fanelli, E.; Braghetti, M.,
A differential scanning calorimetric study of some phenol derivatives,
J. Therm. Anal., 1982, 24(2), 273-279. [all data]
Musuc, Razus, et al., 2002
Musuc, A.M.; Razus, D.; Oancea, D.,
Analele Universitatii Bucuresti Chimie, 2002, 11, 2, 147. [all data]
Acree, 1991
Acree, William E.,
Thermodynamic properties of organic compounds: enthalpy of fusion and melting point temperature compilation,
Thermochimica Acta, 1991, 189, 1, 37-56, https://doi.org/10.1016/0040-6031(91)87098-H
. [all data]
Booss and Hauschildt, 1972
Booss, H.J.; Hauschildt, K.R.,
Die Schmelzenthalpie des Benzils und 4-Nitrophenols,
Z. Anal. Chem., 1972, 261(1), 32. [all data]
Wojcik and Marqueton, 1989
Wojcik, G.; Marqueton, Y.,
The phase transition of m-nitrophenol,
Mol. Cryst. Liq. Cryst., 1989, 168, 247-254. [all data]
Paul and Kebarle, 1990
Paul, G.J.C.; Kebarle, P.,
Stabilities in the Gas Phase of the Hydrogen Bonded Complexes, YC6H4OH-X-, of Substituted Phenols, YC6H4OH, with the Halide Anions X-(Cl-, Br-),
Can. J. Chem., 1990, 68, 11, 2070, https://doi.org/10.1139/v90-316
. [all data]
Fujio, McIver, et al., 1981
Fujio, M.; McIver, R.T., Jr.; Taft, R.W.,
Effects on the acidities of phenols from specific substituent-solvent interactions. Inherent substituent parameters from gas phase acidities,
J. Am. Chem. Soc., 1981, 103, 4017. [all data]
Kebarle and McMahon, 1977
Kebarle, P.; McMahon, T.B.,
Intrinsic Acidities of Substituted Phenols and Benzoic Acids Determined by Gas Phase Proton Transfer Equilibria,
J. Am. Chem. Soc., 1977, 99, 7, 2222, https://doi.org/10.1021/ja00449a032
. [all data]
Kobayashi and Nagakura, 1975
Kobayashi, T.; Nagakura, S.,
Photoelectron spectra of nitrophenols and nitroanisoles,
J. Electron Spectrosc. Relat. Phenom., 1975, 6, 421. [all data]
Beynon, Hopkinson, et al., 1969
Beynon, J.H.; Hopkinson, J.A.; Lester, G.R.,
Mass spectrometry-the appearance potentials of "meta-stable peaks" in some aromatic nitro compounds - a chemical reaction in the mass spectrometer,
Intern. J. Mass Spectrom. Ion Phys., 1969, 2, 291. [all data]
Grammaticakis, 1951
Grammaticakis, P.,
Contribution a l'etude de l'absorption dans l'ultraviolet moyen et le visible des arylamines isomeres et de leurs derives N substitues (Premier memoire),
Bull. Soc. Chim. Fr., 1951, 18, 220-226. [all data]
Mitchell and Vernon, 1972
Mitchell, P.T.; Vernon, F.,
Gas-Liquid Chromatography of Nitrophenols and Methyl Derivatives,
J. Chromatogr., 1972, 65, 3, 487-491, https://doi.org/10.1016/S0021-9673(00)84994-8
. [all data]
Tret'yakov, 2007
Tret'yakov, K.V.,
Retention Data. NIST Mass Spectrometry Data Center., NIST Mass Spectrometry Data Center, 2007. [all data]