2-Carene
- Formula: C10H16
- Molecular weight: 136.2340
- IUPAC Standard InChIKey: IBVJWOMJGCHRRW-UHFFFAOYSA-N
- CAS Registry Number: 554-61-0
- Chemical structure:
View 3d structure (requires JavaScript / HTML 5) - Species with the same structure:
- Other names: Bicyclo[4.1.0]hept-2-ene, 3,7,7-trimethyl-; δ-2-Carene; (.+/-.)-2-Carene; 3,7,7-Trimethylbicyclo[4.1.0]hept-2-ene; δ-4-carene; (+)-2-Carene; 4-δ-carene

Gas phase thermochemistry data

Data compiled by: Hussein Y. Afeefy, Joel F. Liebman, and Stephen E. Stein
Quantity | Value | Units | Method | Reference | Comment |
---|---|---|---|---|---|
ΔfH°gas | 6.0 ± 1.0 | kcal/mol | Ccb | Kozina, Aleshina, et al., 1975 |

Condensed phase thermochemistry data

Data compiled by: Hussein Y. Afeefy, Joel F. Liebman, and Stephen E. Stein
Quantity | Value | Units | Method | Reference | Comment |
---|---|---|---|---|---|
ΔfH°liquid | -5.41 ± 0.57 | kcal/mol | Ccb | Kozina, Aleshina, et al., 1975 | |
Quantity | Value | Units | Method | Reference | Comment |
ΔcH°liquid | -1481.63 ± 0.55 | kcal/mol | Ccb | Kozina, Aleshina, et al., 1975 | Corresponding ΔfHºliquid = -5.40 kcal/mol (simple calculation by NIST; no Washburn corrections) |

Gas phase ion energetics data

Data compiled by: Sharon G. Lias, John E. Bartmess, Joel F. Liebman, John L. Holmes, Rhoda D. Levin, and W. Gary Mallard
Ionization energy determinations
IE (eV) | Method | Reference | Comment |
---|---|---|---|
8.2 | PE | Chuiko, Manukov, et al., 1985 | |
8.26 | PE | Chuiko, Manukov, et al., 1985 | Vertical value |

Kovats' RI, non-polar column, temperature ramp

Data compiled by: NIST Mass Spectrometry Data Center, William E. Wallace, director

Column type CapillaryCapillaryCapillaryCapillaryCapillary
Active phase DB-5DB-5DB-5DB-5BPX-5
Column length (m) 30.30.30.30.25.
Carrier gas HeHeHeHeHe
Substrate
Column diameter (mm) 0.260.260.260.250.22
Phase thickness (μm) 0.250.250.250.250.25
Tstart (C) 60.60.60.40.60.
Tend (C) 246.246.246.230.240.
Heat rate (K/min) 3.3.3.8.3.
Initial hold (min)
Final hold (min)    4.
I 1001.1002.1001.1000.1018.
ReferenceAdams, González Elizondo, et al., 2006Adams, Morris, et al., 2005Adams and Nguyen, 2005Ament K., Kant M.R., et al., 2004El-Ghorab, Mansour, et al., 2004
Comment MSDC-RI MSDC-RI MSDC-RI MSDC-RI MSDC-RI
Column type CapillaryCapillaryCapillaryCapillaryCapillary
Active phase HP-5DB-5DB-5HP-5MSSE-54
Column length (m) 30.60.60.30.30.
Carrier gas HeHeHeHeHe
Substrate
Column diameter (mm) 0.250.320.320.250.26
Phase thickness (μm) 0.251.1.0.250.25
Tstart (C) 60.40.40.50.60.
Tend (C) 260.230.230.250.246.
Heat rate (K/min) 3.3.3.3.3.
Initial hold (min)  5.5.
Final hold (min)  2.2.
I 1003.1006.1010.1001.1001.
ReferenceLopes, Strobl, et al., 2004Buchin, Salmon, et al., 2002Buchin, Salmon, et al., 2002Salido, Altarejos, et al., 2002Adams, 2000
Comment MSDC-RI MSDC-RI MSDC-RI MSDC-RI MSDC-RI
Column type CapillaryCapillaryCapillaryCapillary
Active phase DB-5SE-54DB-5DB-5
Column length (m) 30.30.30.30.
Carrier gas He HeHe
Substrate
Column diameter (mm) 0.260.260.260.26
Phase thickness (μm) 0.250.250.250.25
Tstart (C) 60.60.60.60.
Tend (C) 240.246.246.246.
Heat rate (K/min) 3.3.3.3.
Initial hold (min)
Final hold (min)
I 1001.1001.1001.1001.
ReferenceAdams, 2000, 2Adams, 2000, 3Adams, 2000, 4Adams, 1999
Comment MSDC-RI MSDC-RI MSDC-RI MSDC-RI

Normal alkane RI, polar column, custom temperature program

Data compiled by: NIST Mass Spectrometry Data Center, William E. Wallace, director

Column type CapillaryCapillaryCapillaryCapillary
Active phase HP Innowax FSPHP-Innowax FSCHP Innowax FSPInnowax FSC
Column length (m) 60.60.60.60.
Carrier gas HeliumHeHeHe
Substrate
Column diameter (mm) 0.250.250.250.25
Phase thickness (μm) 0.250.250.250.25
Program 60 0C (10 min) 4 0C/min -> 220 0C (10 min) 1 0C/min -> 240 0C (20 min)60C(10min) => 4C/min => 220C (10min) => 1C/min => 240C60C(10min) => 4C/min => 220C (10min) => 1C/min => 240C60C(10min) => 4C/min => 220C(10min) => 1C/min => 240C
I 1146.1146.1146.1146.
ReferenceWedge, Klun, et al., 2009Kürkçüoglu, Hüsnü Can Baser, et al., 2006Tasdemir, Demirci, et al., 2003Baser, Demirei, et al., 2002
Comment MSDC-RI MSDC-RI MSDC-RI MSDC-RI

Kovats' RI, polar column, temperature ramp

Data compiled by: NIST Mass Spectrometry Data Center, William E. Wallace, director

Column type CapillaryCapillary
Active phase DB-WaxDB-Wax
Column length (m) 30.30.
Carrier gas He
Substrate
Column diameter (mm) 0.320.25
Phase thickness (μm) 0.250.25
Tstart (C) 40.40.
Tend (C) 220.240.
Heat rate (K/min) 3.2.
Initial hold (min) 5.
Final hold (min)  40.
I 1125.1122.
ReferenceLopes, Strobl, et al., 2004Nébié, Yaméogo, et al., 2004
Comment MSDC-RI MSDC-RI

Normal alkane RI, non-polar column, isothermal

Data compiled by: NIST Mass Spectrometry Data Center, William E. Wallace, director

Column type Capillary
Active phase DB-5
Column length (m)
Carrier gas
Substrate
Column diameter (mm)
Phase thickness (μm)
Temperature (C) 25.
I 1001.
ReferenceHemmateenejad, Jawadnia, et al., 2007
Comment MSDC-RI

References

Kozina, Aleshina, et al., 1975
Kozina, M.P.; Aleshina, V.A.; Gal'chenko, G.L.; Buinova, E.F.; Bardyshev, I.I.,
Enthalpies of combustion of 3- and 2-carenes,
Vestsi Akad. Nauk. BSSR, Ser. Khim. Nauk., 1975, 14-17. [all data]
Chuiko, Manukov, et al., 1985
Chuiko, V.A.; Manukov, E.N.; Chukhov, Y.V.; Timoshenko, M.M.,
An investigation of terpene hydrocarbons of the carane series by photoelectron spectroscopy,
J. Org. Chem. USSR, 1985, 600. [all data]