2,5-Dihydro-1-methylpyrrole
- Formula: C5H9N
- Molecular weight: 83.1317
- IUPAC Standard InChIKey: AHVYPIQETPWLSZ-UHFFFAOYSA-N
- CAS Registry Number: 554-15-4
- Chemical structure:
View 3d structure (requires JavaScript / HTML 5) - Permanent link for this species. Use this link for bookmarking this species for future reference.

Gas phase ion energetics data

Data compiled as indicated in comments:
LLK - Sharon G. Lias, Rhoda D. Levin, and Sherif A. Kafafi
Ionization energy determinations
IE (eV) | Method | Reference | Comment |
---|---|---|---|
8.21 ± 0.05 | PE | Morishima, Yoshikawa, et al., 1975 | Vertical value; LLK |

References

Morishima, Yoshikawa, et al., 1975
Morishima, I.; Yoshikawa, K.; Hashimoto, M.; Bekki, K.,
Homoallylic interaction between the nitrogen lone pair and the nonadjacent π bond in cyclic and bicyclic amines. I. Photoelectron spectroscopic study,
J. Am. Chem. Soc., 1975, 97, 4283. [all data]