Methyl propionate
- Formula: C4H8O2
- Molecular weight: 88.1051
- IUPAC Standard InChIKey: RJUFJBKOKNCXHH-UHFFFAOYSA-N
- CAS Registry Number: 554-12-1
- Chemical structure:

Condensed phase thermochemistry data

Data compiled as indicated in comments:
ALS - Hussein Y. Afeefy, Joel F. Liebman, and Stephen E. Stein
DH - Eugene S. Domalski and Elizabeth D. Hearing
Quantity | Value | Units | Method | Reference | Comment |
---|---|---|---|---|---|
ΔcH°liquid | -2246. | kJ/mol | Ccb | Schjanberg, 1935 | Corresponding ΔfHºliquid = -471.1 kJ/mol (simple calculation by NIST; no Washburn corrections); ALS |
Constant pressure heat capacity of liquid
Cp,liquid (J/mol*K) | Temperature (K) | Reference | Comment |
---|---|---|---|
171.21 | 298.15 | Pintos, Bravo, et al., 1988 | DH |
174.60 | 301.45 | Zabransky, Hynek, et al., 1987 | T = 296 to 342 K. Unsmoothed experimental datum.; DH |
172.74 | 298.15 | Jimenez, Romani, et al., 1986 | DH |
171.20 | 298.15 | Baluja, Bravo, et al., 1985 | DH |
175.9 | 298.38 | Guseinov, Shubin, et al., 1984 | T = 205 to 348 K. Unsmoothed experimental datum.; DH |
174.2 | 298.15 | Fuchs, 1979 | DH |

Phase change data

Data compiled as indicated in comments:
TRC - Thermodynamics Research Center, NIST Boulder Laboratories, Chris Muzny director
BS - Robert L. Brown and Stephen E. Stein
ALS - Hussein Y. Afeefy, Joel F. Liebman, and Stephen E. Stein
Quantity | Value | Units | Method | Reference | Comment |
---|---|---|---|---|---|
Tboil | 353. ± 1. | K | AVG | N/A | Average of 25 values; Individual data points |
Quantity | Value | Units | Method | Reference | Comment |
Tfus | 185.65 | K | N/A | Timmermans and Mattaar, 1921 | Uncertainty assigned by TRC = 0.5 K; TRC |
Quantity | Value | Units | Method | Reference | Comment |
Tc | 531. ± 5. | K | AVG | N/A | Average of 7 values; Individual data points |
Quantity | Value | Units | Method | Reference | Comment |
Pc | 40.04 | bar | N/A | Young, 1910 | Uncertainty assigned by TRC = 1.0132 bar; TRC |
Pc | 40.050 | bar | N/A | Young and Thomas, 1893 | Uncertainty assigned by TRC = 0.40 bar; TRC |
Pc | 40.41 | bar | N/A | Heilbron, 1891 | Uncertainty assigned by TRC = 1.0132 bar; TRC |
Pc | 40.41 | bar | N/A | Nadezhdin, 1887 | Uncertainty assigned by TRC = 1.0132 bar; TRC |
Quantity | Value | Units | Method | Reference | Comment |
ρc | 3.54 | mol/l | N/A | Young, 1910 | Uncertainty assigned by TRC = 0.11 mol/l; TRC |
ρc | 3.545 | mol/l | N/A | Young and Thomas, 1893 | Uncertainty assigned by TRC = 0.05 mol/l; TRC |
ρc | 3.41 | mol/l | N/A | Heilbron, 1891 | Uncertainty assigned by TRC = 0.11 mol/l; TRC |
ρc | 3.41 | mol/l | N/A | Nadezhdin, 1887 | Uncertainty assigned by TRC = 0.11 mol/l; TRC |
Quantity | Value | Units | Method | Reference | Comment |
ΔvapH° | 35.95 | kJ/mol | N/A | Majer and Svoboda, 1985 | |
ΔvapH° | 34.5 ± 4.2 | kJ/mol | E | Guthrie and Cullimore, 1980 | ALS |
ΔvapH° | 35.82 ± 0.09 | kJ/mol | C | Sunner, Svensson, et al., 1979 | ALS |
ΔvapH° | 32.3 ± 0.02 | kJ/mol | V | Mathews, 1926 | ALS |
Enthalpy of vaporization
ΔvapH (kJ/mol) | Temperature (K) | Reference | Comment |
---|---|---|---|
32.24 | 352.9 | Majer and Svoboda, 1985 |
Enthalpy of vaporization
ΔvapH =
A exp(-βTr) (1 − Tr)β
ΔvapH =
Enthalpy of vaporization (at saturation pressure)
(kJ/mol)
Tr = reduced temperature (T / Tc)
View plot Requires a JavaScript / HTML 5 canvas capable browser.
Temperature (K) | A (kJ/mol) | β | Tc (K) | Reference | Comment |
---|---|---|---|---|---|
298. to 363. | 53.29 | 0.2857 | 530.6 | Majer and Svoboda, 1985 |
Antoine Equation Parameters
log10(P) = A − (B / (T + C))
P = vapor pressure (bar)
T = temperature (K)
View plot Requires a JavaScript / HTML 5 canvas capable browser.
Temperature (K) | A | B | C | Reference | Comment |
---|---|---|---|---|---|
293.74 to 351.90 | 4.03986 | 1155.987 | -65.979 | Polák and Mertl, 1965 | Coefficents calculated by NIST from author's data. |

Reaction thermochemistry data

Data compiled by: Hussein Y. Afeefy, Joel F. Liebman, and Stephen E. Stein
Individual Reactions
By formula: C6H14O3 + H2O = C4H8O2 + 2CH4O
Quantity | Value | Units | Method | Reference | Comment |
---|---|---|---|---|---|
ΔrH° | -26.12 ± 0.067 | kJ/mol | Cm | Wiberg, Martin, et al., 1985 | liquid phase; solvent: Aqueous dioxane |
ΔrH° | -51.76 ± 0.54 | kJ/mol | Eqk | Guthrie and Cullimore, 1980 | liquid phase |
ΔrH° | -26.28 ± 0.071 | kJ/mol | Cm | Wiberg, 1980 | liquid phase; solvent: Water; Hydrolysis |
By formula: 2H2 + C4H4O2 = C4H8O2
Quantity | Value | Units | Method | Reference | Comment |
---|---|---|---|---|---|
ΔrH° | -331. ± 4.6 | kJ/mol | Chyd | Flitcroft and Skinner, 1958 | liquid phase; solvent: Ethanol |
By formula: C4H8O2 + H2O = CH4O + C3H6O2
Quantity | Value | Units | Method | Reference | Comment |
---|---|---|---|---|---|
ΔrH° | -60.17 ± 0.92 | kJ/mol | Eqk | Guthrie and Cullimore, 1980 | liquid phase |
By formula: H2 + C4H6O2 = C4H8O2
Quantity | Value | Units | Method | Reference | Comment |
---|---|---|---|---|---|
ΔrH° | -501.2 | kJ/mol | Chyd | Veselova and Sul'man, 1980 | liquid phase |

Gas phase ion energetics data

Data evaluated as indicated in comments:
HL - Edward P. Hunter and Sharon G. Lias
L - Sharon G. Lias
Data compiled as indicated in comments:
LBLHLM - Sharon G. Lias, John E. Bartmess, Joel F. Liebman, John L. Holmes, Rhoda D. Levin, and W. Gary Mallard
LLK - Sharon G. Lias, Rhoda D. Levin, and Sherif A. Kafafi
RDSH - Henry M. Rosenstock, Keith Draxl, Bruce W. Steiner, and John T. Herron
Quantity | Value | Units | Method | Reference | Comment |
---|---|---|---|---|---|
IE (evaluated) | 10.15 ± 0.03 | eV | N/A | N/A | L |
Quantity | Value | Units | Method | Reference | Comment |
Proton affinity (review) | 830.2 | kJ/mol | N/A | Hunter and Lias, 1998 | HL |
Quantity | Value | Units | Method | Reference | Comment |
Gas basicity | 799.2 | kJ/mol | N/A | Hunter and Lias, 1998 | HL |
Ionization energy determinations
IE (eV) | Method | Reference | Comment |
---|---|---|---|
10.15 | PI | Traeger, 1985 | LBLHLM |
9.9 ± 0.2 | CEMS | Jalonen, Tedder, et al., 1980 | LLK |
10.15 | EI | Holmes and Lossing, 1980 | LLK |
10.15 ± 0.03 | PI | Watanabe, Nakayama, et al., 1962 | RDSH |
10.30 | PE | Benoit and Harrison, 1977 | Vertical value; LLK |
Appearance energy determinations
Ion | AE (eV) | Other Products | Method | Reference | Comment |
---|---|---|---|---|---|
C2H3O2+ | 11.42 ± 0.05 | C2H5 | EI | Blanchette, Holmes, et al., 1986 | LBLHLM |
C2H3O2+ | 11.9 ± 0.3 | C2H5 | CEMS | Jalonen, Tedder, et al., 1980 | LLK |
C2H5+ | 11.9 ± 0.3 | COOCH3 | CEMS | Jalonen, Tedder, et al., 1980 | LLK |
C3H5O+ | 10.78 | CH3O | PI | Traeger, 1985 | LBLHLM |
C3H5O+ | 11.0 ± 0.1 | OCH3 | CEMS | Jalonen, Tedder, et al., 1980 | LLK |

Kovats' RI, non-polar column, isothermal

Column type | Active phase | Temperature (C) | I | Reference | Comment |
---|---|---|---|---|---|
Capillary | OV-1 | 333. | 615.2 | Hu, Lu, et al., 2006 | |
Capillary | DB-5 | 80. | 600. | Mijin and Antonovic, 2006 | 60. m/0.321 mm/0.25 μm, N2 |
Capillary | SE-54 | 110. | 628.2 | Grigor'eva, Vasil'ev, et al., 1989 | 15. m/0.28 mm/2.5 μm, Ar |
Capillary | SE-54 | 130. | 625.7 | Grigor'eva, Vasil'ev, et al., 1989 | 15. m/0.28 mm/2.5 μm, Ar |
Capillary | SE-54 | 150. | 624. | Grigor'eva, Vasil'ev, et al., 1989 | 15. m/0.28 mm/2.5 μm, Ar |
Capillary | OV-101 | 120. | 629. | Evans, Haken, et al., 1986 | |
Capillary | Apiezon L + KF | 70. | 610. | Svetlova, Samusenko, et al., 1986 | 30. m/0.25 mm/0.06 μm |
Capillary | SE-30 | 100. | 627. | Haken and Korhonen, 1985 | Column length: 25. m; Column diameter: 0.33 mm |
Capillary | SE-30 | 120. | 622. | Haken and Korhonen, 1985 | Column length: 25. m; Column diameter: 0.33 mm |
Capillary | SE-30 | 80. | 607. | Haken and Korhonen, 1985 | Column length: 25. m; Column diameter: 0.33 mm |
Capillary | OV-101 | 100. | 615. | Horna, Táborský, et al., 1985 | N2; Column length: 19. m; Column diameter: 0.28 mm |
Capillary | OV-101 | 100. | 627. | Haken and Korhonen, 1984 | N2; Column length: 25. m; Column diameter: 0.3 mm |
Capillary | OV-101 | 120. | 629. | Haken and Korhonen, 1984 | N2; Column length: 25. m; Column diameter: 0.3 mm |
Capillary | OV-101 | 80. | 618. | Haken and Korhonen, 1984 | N2; Column length: 25. m; Column diameter: 0.3 mm |
Capillary | OV-101 | 80. | 618. | Komárek, Hornová, et al., 1983 | Column length: 15. m; Column diameter: 0.22 mm |
Packed | SE-30 | 150. | 617. | Ashes and Haken, 1974 | Celaton (62-72 mesh); Column length: 3.7 m |
Packed | SE-30 | 100. | 612. | Zarazir, Chovin, et al., 1970 | Chromosorb W; Column length: 2. m |
Packed | SE-30 | 150. | 607. | Germaine and Haken, 1969 | Celite 560; Column length: 3.7 m |
Packed | E-301 | 170. | 600. | Shashkova, Znamenskaia, et al., 1969 | He, Celite 545 (0.20-0.50 mm); Column length: 2. m |

Kovats' RI, non-polar column, temperature ramp

Column type | Active phase | I | Reference | Comment |
---|---|---|---|---|
Capillary | BP-1 | 610. | Bartley and Schwede, 1989 | He, 30. C @ 2. min, 2. K/min; Column length: 50. m; Column diameter: 0.23 mm; Tend: 200. C |

Kovats' RI, non-polar column, custom temperature program

Column type | Active phase | I | Reference | Comment |
---|---|---|---|---|
Capillary | SE-30 | 617. | Chretien and Dubois, 1978 | Program: not specified |

Kovats' RI, polar column, isothermal

Column type | Active phase | Temperature (C) | I | Reference | Comment |
---|---|---|---|---|---|
Capillary | OV-351 | 100. | 937. | Haken and Korhonen, 1985 | N2; Column length: 25. m; Column diameter: 0.32 mm |
Capillary | OV-351 | 80. | 909. | Haken and Korhonen, 1985 | N2; Column length: 25. m; Column diameter: 0.32 mm |
Capillary | SP-1000 | 100. | 905. | Horna, Táborský, et al., 1985 | N2; Column length: 46. m; Column diameter: 0.23 mm |
Packed | Carbowax 20M | 100. | 916. | Zarazir, Chovin, et al., 1970 | Chromosorb W; Column length: 2. m |
Packed | Polyethylene Glycol | 170. | 906. | Shashkova, Znamenskaia, et al., 1969 | He, Celite 545 (0.20-0.50 mm); Column length: 2. m |

Van Den Dool and Kratz RI, non-polar column, temperature ramp

Column type | Active phase | I | Reference | Comment |
---|---|---|---|---|
Capillary | CP-Sil 8CB-MS | 627. | Bruna, Hierro, et al., 2003 | 60. m/0.25 mm/0.25 μm, 40. C @ 2. min, 4. K/min, 280. C @ 5. min |
Capillary | CP-Sil 8CB-MS | 627. | Bruna, Hierro, et al., 2001 | 60. m/0.25 mm/0.25 μm, 40. C @ 2. min, 4. K/min; Tend: 280. C |
Capillary | OV-101 | 614. | Golovnya, Syomina, et al., 1997 | 50. m/0.25 mm/0.25 μm, He, 8. K/min; Tstart: 140. C |
Capillary | SE-30 | 611.6 | Grigor'eva, Golovnya, et al., 1997 | 25. m/0.32 mm/1. μm, He, 8. K/min; Tstart: 140. C |

Van Den Dool and Kratz RI, non-polar column, custom temperature program

Column type | Active phase | I | Reference | Comment |
---|---|---|---|---|
Capillary | DB-5 | 621. | Beaulieu and Grimm, 2001 | 30. m/0.25 mm/0.25 μm, He; Program: 50C (1min) => 5C/min => 100C => 10C/min => 250C (9min) |
Capillary | BPX-5 | 615. | Bauchot, Mottram, et al., 1998 | 50. m/0.32 mm/0.50 μm, He; Program: 0 0C (8 min) -> (1 min) -> 50 0C (2 min) 2.5 0C/min -> 100 0C 6 0C/min -> 250 0C |
Packed | SE-30 | 613. | Peng, Ding, et al., 1988 | Supelcoport; Chromosorb; Column length: 3.05 m; Program: 40C(5min) => 10C/min => 200C or 250C (60min) |

Van Den Dool and Kratz RI, polar column, temperature ramp

Column type | Active phase | I | Reference | Comment |
---|---|---|---|---|
Capillary | CP-Wax 52CB | 908. | Kourkoutas, Elmore, et al., 2006 | 60. m/0.25 mm/0.25 μm, He, 4. K/min; Tstart: 40. C; Tend: 250. C |
Capillary | DB-Wax | 899. | Peng, 2000 | 15. m/0.53 mm/1. μm, He, 40. C @ 3. min, 5. K/min, 220. C @ 30. min |
Capillary | HP-Wax | 908. | Peng, 2000 | 15. m/0.53 mm/1. μm, He, 40. C @ 3. min, 5. K/min, 220. C @ 30. min |
Capillary | Carbowax 20M | 890. | Suárez and Duque, 1991 | 2. K/min; Column length: 25. m; Column diameter: 0.31 mm; Tstart: 50. C; Tend: 200. C |
Capillary | Carbowax 20M | 896. | Suárez and Duque, 1991 | 2. K/min; Column length: 25. m; Column diameter: 0.31 mm; Tstart: 50. C; Tend: 200. C |
Packed | Carbowax 20M | 885. | van den Dool and Kratz, 1963 | Celite 545, 4.6 K/min; Tstart: 75. C; Tend: 228. C |

Van Den Dool and Kratz RI, polar column, custom temperature program

Column type | Active phase | I | Reference | Comment |
---|---|---|---|---|
Capillary | Supelcowax-10 | 911. | Bianchi, Careri, et al., 2007 | 30. m/0.25 mm/0.25 μm, He; Program: 35C(8min) => 4C/min => 60C => 6C/min => 160C => 20C/min => 200C(1min) |

Normal alkane RI, non-polar column, isothermal

Column type | Active phase | Temperature (C) | I | Reference | Comment |
---|---|---|---|---|---|
Capillary | OV-101 | 120. | 621. | Blazso, Ujszaszi, et al., 1980 | Column length: 20. m; Column diameter: 0.23 mm |
Capillary | OV-101 | 160. | 611. | Blazso, Ujszaszi, et al., 1980 | Column length: 20. m; Column diameter: 0.23 mm |
Packed | SE-30 | 70. | 626. | Yabumoto, Jennings, et al., 1977 |

Normal alkane RI, non-polar column, temperature ramp

Column type | Active phase | I | Reference | Comment |
---|---|---|---|---|
Capillary | RTx-1 | 618. | Dib, Bendahou, et al., 2010 | 60. m/0.22 mm/0.25 μm, Helium, 2. K/min, 230. C @ 35. min; Tstart: 60. C |
Capillary | HP-5 | 642.6 | Leffingwell and Alford, 2005 | 60. m/0.32 mm/0.25 μm, He, 30. C @ 2. min, 2. K/min, 260. C @ 28. min |
Capillary | OV-101 | 611. | Anker, Jurs, et al., 1990 | 2. K/min; Column length: 50. m; Column diameter: 0.28 mm; Tstart: 80. C; Tend: 200. C |
Capillary | DB-1 | 618. | Habu, Flath, et al., 1985 | 3. K/min; Column length: 50. m; Column diameter: 0.32 mm; Tstart: 0. C; Tend: 250. C |
Capillary | SE-30 | 621. | Dirinck, de Pooter, et al., 1981 | N2, 2. K/min; Column length: 200. m; Column diameter: 0.6 mm; Tstart: 20. C; Tend: 220. C |

Normal alkane RI, non-polar column, custom temperature program

Column type | Active phase | I | Reference | Comment |
---|---|---|---|---|
Capillary | RTx-1 | 611. | Dib, Bendahou, et al., 2010 | 60. m/0.22 mm/0.25 μm, Helium; Program: not specified |
Capillary | HP-5 | 630. | Rotsatschakul, Visesanguan, et al., 2009 | 60. m/0.25 mm/0.25 μm, Helium; Program: 30 0C (2 min) 2 0Cmin -> 60 0C 10 0C/min -> 100 0C 20 0C/min -> 140 0C 10 0C/min -> 200 0C (10 min) |
Capillary | Methyl Silicone | 617. | Chen and Feng, 2007 | Program: not specified |
Capillary | VB-5 | 622. | Karlshøj, Nielsen, et al., 2007 | 60. m/0.25 mm/1. μm, He; Program: 35C(1min) => 4C/min => 175C => 10C/min => 260C |
Capillary | SE-30 | 617. | Liu, Liang, et al., 2007 | Program: not specified |
Capillary | SE-30 | 611. | Vinogradov, 2004 | Program: not specified |
Capillary | HP-5 | 604. | Jordán, Margaría, et al., 2002 | 30. m/0.25 mm/0.25 μm; Program: 40C (6min) => 2.5C/min => 150C => 90C/min => 250C |
Capillary | Methyl Silicone | 617. | N/A | Program: not specified |
Capillary | Methyl Silicone | 615. | Estrada and Gutierrez, 1999 | Program: not specified |
Capillary | DB-1 | 621. | Yen and Lin, 1999 | 60. m/0.32 mm/0.25 μm, N2; Program: 40 0C (10 min) 40 - 80 0C at 2 0C/min 80 - 200 0C at 5 0C/min 200 0C (10 min) |
Capillary | SPB-1 | 616. | Flanagan, Streete, et al., 1997 | 60. m/0.53 mm/5. μm, He; Program: 40C(6min) => 5C/min => 80C => 10C/min => 200C |
Capillary | SPB-1 | 616. | Strete, Ruprah, et al., 1992 | 60. m/0.53 mm/5.0 μm, Helium; Program: 40 0C (6 min) 5 0C/min -> 80 0C 10 0C/min -> 200 0C |
Capillary | SPB-1 | 639. | Strete, Ruprah, et al., 1992 | 60. m/0.53 mm/5.0 μm, Helium; Program: not specified |
Capillary | OV-1 | 639. | Ramsey and Flanagan, 1982 | Program: not specified |

Normal alkane RI, polar column, isothermal

Column type | Active phase | Temperature (C) | I | Reference | Comment |
---|---|---|---|---|---|
Packed | Carbowax 20M | 100. | 901. | Yabumoto, Jennings, et al., 1977 |

Normal alkane RI, polar column, temperature ramp

Column type | Active phase | I | Reference | Comment |
---|---|---|---|---|
Capillary | DB-Wax | 906. | Hayata, Sakamoto, et al., 2002 | 60. m/0.25 mm/0.25 μm, He, 40. C @ 10. min, 3. K/min, 220. C @ 10. min |
Capillary | HP-Wax | 872. | Sanz, Maeztu, et al., 2002 | 60. m/0.25 mm/0.5 μm, He, 40. C @ 6. min, 3. K/min; Tend: 190. C |
Capillary | HP-Wax | 872. | Maeztu, Sanz, et al., 2001 | 60. m/0.25 mm/0.5 μm, He, 40. C @ 6. min, 3. K/min; Tend: 190. C |
Capillary | HP-Wax | 872. | Sanz, Ansorena, et al., 2001 | 60. m/0.25 mm/0.5 μm, He, 40. C @ 6. min, 3. K/min; Tend: 190. C |
Capillary | Carbowax 20M | 896. | Anker, Jurs, et al., 1990 | 2. K/min; Column length: 80. m; Column diameter: 0.2 mm; Tstart: 70. C; Tend: 170. C |
Capillary | DB-Wax | 904. | Takeoka and Butter, 1989 | 60. m/0.32 mm/0.25 μm, He, 30. C @ 4. min, 2. K/min; Tend: 180. C |
Capillary | DB-Wax | 904. | Takeoka and Butter, 1989 | 60. m/0.32 mm/0.25 μm, He, 30. C @ 4. min, 2. K/min; Tend: 180. C |

Normal alkane RI, polar column, custom temperature program

Column type | Active phase | I | Reference | Comment |
---|---|---|---|---|
Capillary | SOLGel-Wax | 905. | Johanningsmeier and McFeeters, 2011 | 30. m/0.25 mm/0.25 μm, Helium; Program: 40 0C (2 min) 5 0C/min -> 140 0C 10 0C/min -> 250 0C (3 min) |
Capillary | SOLGel-Wax | 905. | Johanningsmeier and McFeeters, 2011 | 30. m/0.25 mm/0.25 μm, Helium; Program: 40 0C (2 min) 5 0C/min -> 140 0C 10 0C/min -> 250 0C (3 min) |
Capillary | SOLGel-Wax | 911. | Johanningsmeier and McFeeters, 2011 | 30. m/0.25 mm/0.25 μm, Helium; Program: not specified |
Capillary | Carbowax 20M | 896. | Vinogradov, 2004 | Program: not specified |
Capillary | DB-Wax | 900. | Peng, Yang, et al., 1991 | Program: not specified |
Capillary | Carbowax 400, Carbowax 20M, Carbowax 1540, Carbowax 4000, Superox 06, PEG 20M, etc. | 885. | Waggott and Davies, 1984 | Hydrogen; Column length: 50. m; Column diameter: 0.32 mm; Program: not specified |
Capillary | Carbowax 400, Carbowax 20M, Carbowax 1540, Carbowax 4000, Superox 06, PEG 20M, etc. | 905. | Waggott and Davies, 1984 | Hydrogen; Column length: 50. m; Column diameter: 0.32 mm; Program: not specified |
Capillary | Carbowax 20M | 910. | Ramsey and Flanagan, 1982 | Program: not specified |

Henry's Law data

Data compiled by: Rolf Sander
Henry's Law constant (water solution)
kH(T) = k°H exp(d(ln(kH))/d(1/T) ((1/T) - 1/(298.15 K)))
k°H = Henry's law constant for solubility in water at 298.15 K (mol/(kg*bar))
d(ln(kH))/d(1/T) = Temperature dependence constant (K)
k°H (mol/(kg*bar)) | d(ln(kH))/d(1/T) (K) | Method | Reference |
---|---|---|---|
6.2 | V | N/A | |
5.7 | M | Buttery, Ling, et al., 1969 |

References

Schjanberg, 1935
Schjanberg, E.,
Die Verbrennungswarmen und die Refraktionsdaten einiger chlorsubstituierter Fettsauren und Ester.,
Z. Phys. Chem. Abt. A, 1935, 172, 197-233. [all data]
Pintos, Bravo, et al., 1988
Pintos, M.; Bravo, R.; Baluja, M.C.; Paz Andrade, M.I.; Roux-Desgranges, G.; Grolier, J.-P.E.,
Can. J. Chem., 1988, 1179. [all data]
Zabransky, Hynek, et al., 1987
Zabransky, M.; Hynek, V.; Finkeova-Hastabova, J.; Vesely, F.,
Heat capacities of six liquid esters as a function of temperature,
Coll. Czech. Chem. Comm., 1987, 52, 251-256. [all data]
Jimenez, Romani, et al., 1986
Jimenez, E.; Romani, L.; Paz Andrade, M.I.; Roux-Desgranges, G.; Grolier, J.-P.E.,
Molar excess heat capacities and volumes for mixtures of alkanoates with cyclohexane at 25°C,
J. Solution Chem., 1986, 15(11), 879-890. [all data]
Baluja, Bravo, et al., 1985
Baluja, M.C.; Bravo, R.; Pintos, M.; Paz Andrade, M.I.; Roux-Desgranges, G.; Grolier, J.-P.E.,
Unusual dependence on concentration of the excess heat capacities of ester solutions in alkanes,
Calorim. Anal. Therm., 1985, 16, 138-144. [all data]
Guseinov, Shubin, et al., 1984
Guseinov, K.D.; Shubin, V.V.; Klimova, T.F.,
Study of the enthalpy of liquid propionate esters, Izv. Vyssh. Uchebn. Zaved,
Neft. Gaz, 1984, 27(8), 54-57. [all data]
Fuchs, 1979
Fuchs, R.,
Heat capacities of some liquid aliphatic, alicyclic, and aromatic esters at 298.15 K,
J. Chem. Thermodyn., 1979, 11, 959-961. [all data]
Timmermans and Mattaar, 1921
Timmermans, J.; Mattaar, J.F.,
Freezing points of orgainic substances VI. New experimental determinations.,
Bull. Soc. Chim. Belg., 1921, 30, 213. [all data]
Young, 1910
Young, S.,
The Internal Heat of Vaporization constants of thirty pure substances,
Sci. Proc. R. Dublin Soc., 1910, 12, 374. [all data]
Young and Thomas, 1893
Young, S.; Thomas, G.L.,
The vapour pressures, molecular volumes, and critical constants of ten of the lower esters,
J. Chem. Soc., 1893, 63, 1191. [all data]
Heilbron, 1891
Heilbron, E.,
Summary of the Critical Data Up To Now on Liquids.,
Z. Phys. Chem., Stoechiom. Verwandtschaftsl., 1891, 1, 601-13. [all data]
Nadezhdin, 1887
Nadezhdin, A.,
Rep. Phys., 1887, 23, 708. [all data]
Majer and Svoboda, 1985
Majer, V.; Svoboda, V.,
Enthalpies of Vaporization of Organic Compounds: A Critical Review and Data Compilation, Blackwell Scientific Publications, Oxford, 1985, 300. [all data]
Guthrie and Cullimore, 1980
Guthrie, J.P.; Cullimore, P.A.,
Effect of the acyl substituent on the equilibrium constant for hydration of esters,
Can. J. Chem., 1980, 58, 1281-1294. [all data]
Sunner, Svensson, et al., 1979
Sunner, S.; Svensson, Ch.; Zelepuga, A.S.,
Enthalpies of vaporization at 298.15 K for some 2-alkanones and methyl alkanoates,
J. Chem. Thermodyn., 1979, 11, 491-495. [all data]
Mathews, 1926
Mathews, J.H.,
The accurate measurement of heats of vaporization of liquids,
J. Am. Chem. Soc., 1926, 48, 562-576. [all data]
Polák and Mertl, 1965
Polák, J.; Mertl, I.,
Saturated vapour pressure of methyl acetate, ethyl acetate, n-propyl acetate, methyl propionate, and ethyl propionate,
Collect. Czech. Chem. Commun., 1965, 30, 10, 3526-3528, https://doi.org/10.1135/cccc19653526
. [all data]
Wiberg, Martin, et al., 1985
Wiberg, K.B.; Martin, E.J.; Squires, R.R.,
Thermochemical studies of carbonyl compounds. 3. Enthalpies of hydrolysis of ortho esters,
J. Org. Chem., 1985, 50, 4717-4720. [all data]
Wiberg, 1980
Wiberg, K.B.,
Energies of organic compounds,
Rept. DOE-E(11-1)4060 Prepared for US Dept. of Energy by Yale Univ., New Haven, CT. Avail. NTIS, 1980, 1-24. [all data]
Flitcroft and Skinner, 1958
Flitcroft, T.L.; Skinner, H.A.,
Heats of hydrogenation Part 2.-Acetylene derivatives,
Trans. Faraday Soc., 1958, 54, 47-53. [all data]
Veselova and Sul'man, 1980
Veselova, M.E.; Sul'man, E.M.,
Effect of the chemical structure of α,β-unsaturated esters and ketones on the selectivity of their hydrogenation,
Svoistva Veshchestv i Stroenie Molekul, Kalinin, 1980, 140-143. [all data]
Hunter and Lias, 1998
Hunter, E.P.; Lias, S.G.,
Evaluated Gas Phase Basicities and Proton Affinities of Molecules: An Update,
J. Phys. Chem. Ref. Data, 1998, 27, 3, 413-656, https://doi.org/10.1063/1.556018
. [all data]
Traeger, 1985
Traeger, J.C.,
Heat of formation for the propanoyl cation by photoionization mass spectrometry,
Org. Mass Spectrom., 1985, 20, 223. [all data]
Jalonen, Tedder, et al., 1980
Jalonen, J.; Tedder, J.M.; Nidaud, P.H.,
Charge-exchange mass spectra of ethyl acetate, methyl proprionate and propyl formate,
J. Chem. Soc. Faraday Trans. 2, 1980, 76, 1450. [all data]
Holmes and Lossing, 1980
Holmes, J.L.; Lossing, F.P.,
Gas-phase heats of formation of keto and enol ions of carbonyl compounds.,
J. Am. Chem. Soc., 1980, 102, 1591. [all data]
Watanabe, Nakayama, et al., 1962
Watanabe, K.; Nakayama, T.; Mottl, J.,
Ionization potentials of some molecules,
J. Quant. Spectry. Radiative Transfer, 1962, 2, 369. [all data]
Benoit and Harrison, 1977
Benoit, F.M.; Harrison, A.G.,
Predictive value of proton affinity. Ionization energy correlations involving oxygenated molecules,
J. Am. Chem. Soc., 1977, 99, 3980. [all data]
Blanchette, Holmes, et al., 1986
Blanchette, M.C.; Holmes, J.L.; Hop, C.E.C.A.; Lossing, F.P.; Postma, R.; Ruttink, P.J.A.; Terlouw, J.K.,
Theory and experiment in concert; the CH3O-C=O+ ion and its isomers,
J. Am. Chem. Soc., 1986, 108, 7589. [all data]
Hu, Lu, et al., 2006
Hu, X.-F.; Lu, C.-H.; Yin, C.-S.,
Modeling Gas Chromatographic Retention Indices of Oxygen-containing Compounds by Novel Atom-type Topological Indices,
Chinese Journal of Chemical Physics, 2006, 19, 3, 243-247, https://doi.org/10.1360/cjcp2006.19(3).243.5
. [all data]
Mijin and Antonovic, 2006
Mijin, D.; Antonovic, D.G.,
The temperature dependence of the retention index for n-alkyl esters of acetic, propionic, cyclohexanecarboxylic, benzoic and phenylacetic acid on DB-1 and DB-5 capillary columns,
J. Serb. Chem. Soc., 2006, 71, 6, 629-637, https://doi.org/10.2298/JSC0606629M
. [all data]
Grigor'eva, Vasil'ev, et al., 1989
Grigor'eva, D.N.; Vasil'ev, A.V.; Golovnya, R.V.,
Variation in retention indices and equivalent chain lengths of homologous series of n-alkyl acetates, n-alkyl methyl ketones, and methyl esters of aliphatic carboxylic acids as a function of homolog number and analysis temperature,
Zh. Anal. Khim., 1989, 44, 1, 68-73. [all data]
Evans, Haken, et al., 1986
Evans, M.B.; Haken, J.K.; Tóth, T.,
Solute characterization in gas chromatography by an extension of Kováts retention index system. Dispersion and selectivity indices,
J. Chromatogr., 1986, 351, 155-164, https://doi.org/10.1016/S0021-9673(01)83484-1
. [all data]
Svetlova, Samusenko, et al., 1986
Svetlova, N.I.; Samusenko, A.L.; Golovnya, R.V.,
Advantage of the universal equation over the linear equation for the calculation of retention parameters of homologous series in capillary chromatography,
J. Hi. Res. Chromatogr. Chromatogr. Comm., 1986, 9, 12, 737-740, https://doi.org/10.1002/jhrc.1240091205
. [all data]
Haken and Korhonen, 1985
Haken, J.K.; Korhonen, I.O.O.,
Gas chromatography of homologous esters. XXVII. Retention increments of C1-C18 primary alkanols and their 2-chloropropanoyl and 3-chloropropanoyl derivatives on SE-30 and OV-351 capillary columns,
J. Chromatogr., 1985, 319, 131-142, https://doi.org/10.1016/S0021-9673(01)90548-5
. [all data]
Horna, Táborský, et al., 1985
Horna, A.; Táborský, J.; Churácek, J.; Dufka, O.,
Chromatography of monomers. IV. Gas-liquid chromatographic studies of C1-C6 n-alkyl and C3-C6 isoalkyl acrylates and their hydrogen halide and halogen addition derivatives,
J. Chromatogr., 1985, 348, 141-149, https://doi.org/10.1016/S0021-9673(01)92447-1
. [all data]
Haken and Korhonen, 1984
Haken, J.K.; Korhonen, I.O.O.,
Gas chromatography of homologous esters. XXIV. Studies of chlorinated methyl propanoates and butanoates on a non-polar capillary column,
J. Chromatogr., 1984, 284, 474-477, https://doi.org/10.1016/S0021-9673(01)87849-3
. [all data]
Komárek, Hornová, et al., 1983
Komárek, K.; Hornová, L.; Horna, A.; Churácek, J.,
Glass capillary gas chromatography of homologous series of esters. III. Separation of alkyl halogenopropionates and halogenobutyrates on OV-101,
J. Chromatogr., 1983, 262, 316-320, https://doi.org/10.1016/S0021-9673(01)88112-7
. [all data]
Ashes and Haken, 1974
Ashes, J.R.; Haken, J.K.,
Gas chromatography of homologous esters. VI. Structure-retention increments of aliphatic esters,
J. Chromatogr., 1974, 101, 1, 103-123, https://doi.org/10.1016/S0021-9673(01)94737-5
. [all data]
Zarazir, Chovin, et al., 1970
Zarazir, D.; Chovin, P.; Guiochon, G.,
Identification of hydroxylic compounds and their derivatives by gas chromatography,
Chromatographia, 1970, 3, 4, 180-195, https://doi.org/10.1007/BF02269018
. [all data]
Germaine and Haken, 1969
Germaine, R.W.; Haken, J.K.,
Gas chromatography of homologous esters. Part 1. Simple aliphatic esters,
J. Chromatogr., 1969, 43, 33-42, https://doi.org/10.1016/S0021-9673(00)99162-3
. [all data]
Shashkova, Znamenskaia, et al., 1969
Shashkova, A.A.; Znamenskaia, A.P.; Pas'ko, L.Ya.,
Investigation of esters of odd series halohenated acids with Kovats indices,
Gazovaya Khromatografiya, 1969, 9, 40-47. [all data]
Bartley and Schwede, 1989
Bartley, J.P.; Schwede, A.M.,
Production of volatile componds in ripening kiwi fruit (Actinidia chinensis),
J. Agric. Food Chem., 1989, 37, 4, 1023-1025, https://doi.org/10.1021/jf00088a046
. [all data]
Chretien and Dubois, 1978
Chretien, J.R.; Dubois, J-E.,
Topological Analysis: A Technique for the Physico-Chemical Exploitation of Retention Data in Gas-Liquid Chromatography,
J. Chromatogr., 1978, 158, 43-56, https://doi.org/10.1016/S0021-9673(00)89954-9
. [all data]
Bruna, Hierro, et al., 2003
Bruna, J.M.; Hierro, E.M.; de la Hoz, L.; Mottram, D.S.; Fernández, M.; Ordóñez, J.A.,
Changes in selected biochemical and sensory parameters as affected by the superficial inoculation of Penicillium camemberti on dry fermented sausages,
Int. J. Food Microbiol., 2003, 85, 1-2, 111-125, https://doi.org/10.1016/S0168-1605(02)00505-6
. [all data]
Bruna, Hierro, et al., 2001
Bruna, J.M.; Hierro, E.M.; de la Hoz, L.; Mottram, D.S.; Fernández, M.; Ordóñez, J.A.,
The contribution of Penicillium aurantiogriseum to the volatile composition and sensory quality of dry fermented sausages,
Meat Sci., 2001, 59, 1, 97-107, https://doi.org/10.1016/S0309-1740(01)00058-4
. [all data]
Golovnya, Syomina, et al., 1997
Golovnya, R.V.; Syomina, L.A.; Samusenko, A.L.,
Nonlinear variation of sorption parameters of n-alkane homologs in temperature-programmed gas chromatography (TPGC) and new equation for calculation of retention indices,
J. Hi. Res. Chromatogr., 1997, 20, 11, 611-614, https://doi.org/10.1002/jhrc.1240201108
. [all data]
Grigor'eva, Golovnya, et al., 1997
Grigor'eva, D.N.; Golovnya, R.V.; Syomina, L.A.,
An equation for the calculation of retention indices in temperature-programmed gas chromatography with allowance for the nonlinear variation of the retention parameters of n-alkanes,
Russ. Chem. Bull. (Engl. Transl.), 1997, 46, 2, 309-313, https://doi.org/10.1007/BF02494369
. [all data]
Beaulieu and Grimm, 2001
Beaulieu, J.C.; Grimm, C.C.,
Identification of volatile compounds in cantaloupe at various developmental stages using solid phase microextraction,
J. Agric. Food Chem., 2001, 49, 3, 1345-1352, https://doi.org/10.1021/jf0005768
. [all data]
Bauchot, Mottram, et al., 1998
Bauchot, A.D.; Mottram, D.S.; Dodson, A.T.; John, P.,
Effect of aminocyclopropane-1-carboxylic acid oxidase antisense gene on the formation of volatile esters in cantaloupe charentais melon (Cv. Védrandais),
J. Agric. Food Chem., 1998, 46, 11, 4787-4792, https://doi.org/10.1021/jf980692z
. [all data]
Peng, Ding, et al., 1988
Peng, C.T.; Ding, S.F.; Hua, R.L.; Yang, Z.C.,
Prediction of Retention Indexes I. Structure-Retention Index Relationship on Apolar Columns,
J. Chromatogr., 1988, 436, 137-172, https://doi.org/10.1016/S0021-9673(00)94575-8
. [all data]
Kourkoutas, Elmore, et al., 2006
Kourkoutas, D.; Elmore, J.S.; Mottram, D.S.,
Comparison of the volatile compositions and flavour properties of cantaloupe, Galia and honeydew muskmelons,
Food Chem., 2006, 97, 1, 95-102, https://doi.org/10.1016/j.foodchem.2005.03.026
. [all data]
Peng, 2000
Peng, C.T.,
Prediction of retention indices. V. Influence of electronic effects and column polarity on retention index,
J. Chromatogr. A, 2000, 903, 1-2, 117-143, https://doi.org/10.1016/S0021-9673(00)00901-8
. [all data]
Suárez and Duque, 1991
Suárez, M.; Duque, C.,
Volatile constituents of lulo (Salanum vestissimum D.) fruit,
J. Agric. Food Chem., 1991, 39, 8, 1498-1500, https://doi.org/10.1021/jf00008a026
. [all data]
van den Dool and Kratz, 1963
van den Dool, H.; Kratz, P. Dec.,
A generalization of the retention index system including linear temperature programmed gas-liquid partition chromatography,
J. Chromatogr., 1963, 11, 463-471, https://doi.org/10.1016/S0021-9673(01)80947-X
. [all data]
Bianchi, Careri, et al., 2007
Bianchi, F.; Careri, M.; Mangia, A.; Musci, M.,
Retention indices in the analysis of food aroma volatile compounds in temperature-programmed gas chromatography: Database creation and evaluation of precision and robustness,
J. Sep. Sci., 2007, 39, 4, 563-572, https://doi.org/10.1002/jssc.200600393
. [all data]
Blazso, Ujszaszi, et al., 1980
Blazso, M.; Ujszaszi, K.; Jakab, E.,
Isomeric structure of styrene-acrylonitrile and styrene-methylacrylate copolymer pyrolysis products,
Chromatographia, 1980, 13, 3, 151-156, https://doi.org/10.1007/BF02259304
. [all data]
Yabumoto, Jennings, et al., 1977
Yabumoto, K.; Jennings, W.G.; Yamaguchi, M.,
Gas chromatographic retention as identification criteria,
Anal. Biochem., 1977, 78, 1, 244-251, https://doi.org/10.1016/0003-2697(77)90029-X
. [all data]
Dib, Bendahou, et al., 2010
Dib, M.A.; Bendahou, M.; Bendiabdellah, A.; Djabou, N.; Allali, H.; Tabti, B.; Paolini, J.; Costa, J.,
Partial chemical composition and antimicrobial activity of Daucus crinitus Desf. extracts,
Grasas y Aceites, 2010, 61, 3, 271-278, https://doi.org/10.3989/gya.122609
. [all data]
Leffingwell and Alford, 2005
Leffingwell, J.C.; Alford, E.D.,
Volatile constituents of Perique tobacco,
Electron. J. Environ. Agric. Food Chem., 2005, 4, 2, 899-915. [all data]
Anker, Jurs, et al., 1990
Anker, L.S.; Jurs, P.C.; Edwards, P.A.,
Quantitative structure-retention relationship studies of odor-active aliphatic compounds with oxygen-containing functional groups,
Anal. Chem., 1990, 62, 24, 2676-2684, https://doi.org/10.1021/ac00223a006
. [all data]
Habu, Flath, et al., 1985
Habu, T.; Flath, R.A.; Mon, T.R.; Morton, J.F.,
Volatile components of Rooibos tea (Aspalathus linearis),
J. Agric. Food Chem., 1985, 33, 2, 249-254, https://doi.org/10.1021/jf00062a024
. [all data]
Dirinck, de Pooter, et al., 1981
Dirinck, P.J.; de Pooter, H.L.; Willaert, G.A.; Schamp, N.M.,
Flavor quality of cultivated strawberries: the role of the sulfur compounds,
J. Agric. Food Chem., 1981, 29, 2, 316-321, https://doi.org/10.1021/jf00104a024
. [all data]
Rotsatschakul, Visesanguan, et al., 2009
Rotsatschakul, P.; Visesanguan, W.; Smitinont, T.; Chaiseri, S.,
Changes in volatile compounds during fermentation of nham (Thai fermented sausage),
Int. Food Res. J., 2009, 16, 391-414. [all data]
Chen and Feng, 2007
Chen, Y.; Feng, C.,
QSPR study on gas chromatography retention index of some organic pollutants,
Comput. Appl. Chem. (China), 2007, 24, 10, 1404-1408. [all data]
Karlshøj, Nielsen, et al., 2007
Karlshøj, K.; Nielsen, P.V.; Larsen, T.O.,
Prediction of Penicillium expansum Spoilage and Patulin Concentration in Apples Used for Apple Juice Production by Electronic Nose Analysis,
J. Agric. Food Chem., 2007, 55, 11, 4289-4298, https://doi.org/10.1021/jf070134x
. [all data]
Liu, Liang, et al., 2007
Liu, F.; Liang, Y.; Cao, C.; Zhou, N.,
QSPR study of GC retention indices for saturated esters on seven stationary phases based on novel topological indices,
Talanta, 2007, 72, 4, 1307-1315, https://doi.org/10.1016/j.talanta.2007.01.038
. [all data]
Vinogradov, 2004
Vinogradov, B.A.,
Production, composition, properties and application of essential oils, 2004, retrieved from http://viness.narod.ru. [all data]
Jordán, Margaría, et al., 2002
Jordán, M.J.; Margaría, C.A.; Shaw, P.E.; Goodner, K.L.,
Aroma active components in aqueous kiwi fruit essence and kiwi fruit puree by GC-MS and multidimensional GC/GC-O,
J. Agric. Food Chem., 2002, 50, 19, 5386-5390, https://doi.org/10.1021/jf020297f
. [all data]
Estrada and Gutierrez, 1999
Estrada, E.; Gutierrez, Y.,
Modeling chromatographic parameters by a novel graph theoretical sub-structural approach,
J. Chromatogr. A, 1999, 858, 2, 187-199, https://doi.org/10.1016/S0021-9673(99)00808-0
. [all data]
Yen and Lin, 1999
Yen, G.-C.; Lin, H.-T.,
Changes in volatile flavor components of guava juice with high-pressure treatment and heat processing and during storage,
J. Agric. Food Chem., 1999, 47, 5, 2082-2087, https://doi.org/10.1021/jf9810057
. [all data]
Flanagan, Streete, et al., 1997
Flanagan, R.J.; Streete, P.J.; Ramsey, J.D.,
Volatile Substance Abuse, UNODC Technical Series, No 5, United Nations, Office on Drugs and Crime, Vienna International Centre, PO Box 500, A-1400 Vienna, Austria, 1997, 56, retrieved from http://www.odccp.org/pdf/technicalseries1997-01-011.pdf. [all data]
Strete, Ruprah, et al., 1992
Strete, P.J.; Ruprah, M.; Ramsey, J.D.; Flanagan, R.J.,
Detection and identification of volatile substances by headspace capillary gas chromatography to aid the diagnosis of acute poisoning,
Analyst, 1992, 117, 7, 1111-1127, https://doi.org/10.1039/an9921701111
. [all data]
Ramsey and Flanagan, 1982
Ramsey, J.D.; Flanagan, R.J.,
Detection and Identification of Volatile Organic Compounds in Blood by Headspace Gas Chromatography as an Aid to the Diagnosis of Solvent Abuse,
J. Chromatogr., 1982, 240, 2, 423-444, https://doi.org/10.1016/S0021-9673(00)99622-5
. [all data]
Hayata, Sakamoto, et al., 2002
Hayata, Y.; Sakamoto, T.; Kozuka, H.; Sakamoto, K.; Osajima, Y.,
Analysis of aromatic volatile compounds in 'Miyabi' melon (Cucumis melo L.) using the Porapak Q column,
J. Jpn. Soc. Hortic. Sci., 2002, 71, 4, 517-525, https://doi.org/10.2503/jjshs.71.517
. [all data]
Sanz, Maeztu, et al., 2002
Sanz, C.; Maeztu, L.; Zapelena, M.J.; Bello, J.; Cid, C.,
Profiles of volatile compounds and sensory analysis of three blends of coffee: influence of different proportions of Arabica and Robusta and influence of roasting coffee with sugar,
J. Sci. Food Agric., 2002, 82, 8, 840-847, https://doi.org/10.1002/jsfa.1110
. [all data]
Maeztu, Sanz, et al., 2001
Maeztu, L.; Sanz, C.; Andueza, S.; de Peña, M.P.; Bello, J.; Cid, C.,
Characterization of espresso coffee aroma by static headspace GC-MS and sensory flavor profile,
J. Agric. Food Chem., 2001, 49, 11, 5437-5444, https://doi.org/10.1021/jf0107959
. [all data]
Sanz, Ansorena, et al., 2001
Sanz, C.; Ansorena, D.; Bello, J.; Cid, C.,
Optimizing headspace temperature and time sampling for identification of volatile compounds in ground roasted Arabica coffee,
J. Agric. Food Chem., 2001, 49, 3, 1364-1369, https://doi.org/10.1021/jf001100r
. [all data]
Takeoka and Butter, 1989
Takeoka, G.; Butter, R.G.,
Volatile constituents of pineapple (Ananas Comosus [L.] Merr.)
in Flavor Chemistry. Trends and Developments, Teranishi,R.; Buttery,R.G.; Shahidi,F., ed(s)., American Chemical Society, Washington, DC, 1989, 223-237. [all data]
Johanningsmeier and McFeeters, 2011
Johanningsmeier, S.D.; McFeeters, R.F.,
Detection of volatile spoilage metabolites in fermented cucumbers using nontargeted, comprehensive 2-dimensional gas chromatography-time-of-flight mass spectrometry (GCxGCxTOFMS),
J. Food Sci., 2011, 76, 1, c168-c177, https://doi.org/10.1111/j.1750-3841.2010.01918.x
. [all data]
Peng, Yang, et al., 1991
Peng, C.T.; Yang, Z.C.; Ding, S.F.,
Prediction of rentention idexes. II. Structure-retention index relationship on polar columns,
J. Chromatogr., 1991, 586, 1, 85-112, https://doi.org/10.1016/0021-9673(91)80028-F
. [all data]
Waggott and Davies, 1984
Waggott, A.; Davies, I.W.,
Identification of organic pollutants using linear temperature programmed retention indices (LTPRIs) - Part II, 1984, retrieved from http://dwi.defra.gov.uk/research/completed-research/reports/dwi0383.pdf. [all data]