p-Benzoquinone, 2-methyl-
- Formula: C7H6O2
- Molecular weight: 122.1213
- IUPAC Standard InChIKey: VTWDKFNVVLAELH-UHFFFAOYSA-N
- CAS Registry Number: 553-97-9
- Chemical structure:

Condensed phase thermochemistry data

Data compiled by: Hussein Y. Afeefy, Joel F. Liebman, and Stephen E. Stein
Quantity | Value | Units | Method | Reference | Comment |
---|---|---|---|---|---|
ΔcH°solid | -3361. | kJ/mol | Ccb | Swietoslawski and Starczedska, 1925 | Corresponding ΔfHºsolid = -251. kJ/mol (simple calculation by NIST; no Washburn corrections) |

Phase change data

Data compiled by: Thermodynamics Research Center, NIST Boulder Laboratories, Chris Muzny director
Quantity | Value | Units | Method | Reference | Comment |
---|---|---|---|---|---|
Tfus | 341.15 | K | N/A | Sabatier and Mailhe, 1909 | Uncertainty assigned by TRC = 2. K |

Gas phase ion energetics data

Data compiled as indicated in comments:
LLK - Sharon G. Lias, Rhoda D. Levin, and Sherif A. Kafafi
B - John E. Bartmess
Electron affinity determinations
EA (eV) | Method | Reference | Comment |
---|---|---|---|
1.852 ± 0.061 | IMRE | Heinis, Chowdhury, et al., 1988 | ΔGea(423 K) = -41.1 kcal/mol; ΔSea (estimated) = -4.0 eu.; B |
1.852 ± 0.048 | IMRE | Fukuda and McIver, 1985 | ΔGea(355 K) = -41.3 kcal/mol; ΔSea =-4.0, est. from data in Heinis, Chowdhury, et al., 1988; B |
Ionization energy determinations
IE (eV) | Method | Reference | Comment |
---|---|---|---|
9.78 | PE | Kobayashi, 1975 | LLK |
9.78 ± 0.02 | PI | Potapov and Sorokin, 1971 | LLK |

Kovats' RI, non-polar column, isothermal

Column type | Active phase | Temperature (C) | I | Reference | Comment |
---|---|---|---|---|---|
Packed | SE-30 | 180. | 1008. | Llobera and García-Raso, 1987 | N2, Chromosorb P AW DMCS; Column length: 2. m |
Packed | SE-30 | 190. | 1015. | Llobera and García-Raso, 1987 | N2, Chromosorb P AW DMCS; Column length: 2. m |
Packed | SE-30 | 200. | 1018. | Llobera and García-Raso, 1987 | N2, Chromosorb P AW DMCS; Column length: 2. m |
Packed | SE-30 | 210. | 1025. | Llobera and García-Raso, 1987 | N2, Chromosorb P AW DMCS; Column length: 2. m |
Packed | SE-30 | 220. | 1031. | Llobera and García-Raso, 1987 | N2, Chromosorb P AW DMCS; Column length: 2. m |

Kovats' RI, polar column, isothermal

Column type | Active phase | Temperature (C) | I | Reference | Comment |
---|---|---|---|---|---|
Packed | Carbowax 20M | 180. | 1616. | Llobera and García-Raso, 1987 | N2, Chromosorb P AW DMCS (60-80 mesh); Column length: 2. m |
Packed | Carbowax 20M | 190. | 1624. | Llobera and García-Raso, 1987 | N2, Chromosorb P AW DMCS (60-80 mesh); Column length: 2. m |
Packed | Carbowax 20M | 200. | 1633. | Llobera and García-Raso, 1987 | N2, Chromosorb P AW DMCS (60-80 mesh); Column length: 2. m |
Packed | Carbowax 20M | 210. | 1640. | Llobera and García-Raso, 1987 | N2, Chromosorb P AW DMCS (60-80 mesh); Column length: 2. m |

References

Swietoslawski and Starczedska, 1925
Swietoslawski, W.; Starczedska, H.,
Correction des donnees thermochimiques de M.A. Valeur,
J. Chem. Phys., 1925, 22, 399-401. [all data]
Sabatier and Mailhe, 1909
Sabatier, P.; Mailhe, A.,
New Applications of the General Method of Hydrogenation with Various Metals,
Ann. Chim. Phys., 1909, 16, 70. [all data]
Heinis, Chowdhury, et al., 1988
Heinis, T.; Chowdhury, S.; Scott, S.L.; Kebarle, P.,
Electron Affinities of Benzo-, Naphtho-, and Anthraquinones Determined from Gas-Phase Equilibria Measurements,
J. Am. Chem. Soc., 1988, 110, 2, 400, https://doi.org/10.1021/ja00210a015
. [all data]
Fukuda and McIver, 1985
Fukuda, E.K.; McIver, R.T., Jr.,
Relative electron affinities of substituted benzophenones, nitrobenzenes, and quinones. [Anchored to EA(SO2) from 74CEL/BEN],
J. Am. Chem. Soc., 1985, 107, 2291. [all data]
Kobayashi, 1975
Kobayashi, T.,
Photoelectron spectra of p-benzoquinones,
J. Electron. Spectrosc. Relat. Phenom., 1975, 7, 349. [all data]
Potapov and Sorokin, 1971
Potapov, V.K.; Sorokin, V.V.,
Photoionization and ion-molecule reactions in quinones and alcohols,
High Energy Chem., 1971, 5, 435, In original 487. [all data]
(editor), 1982
(editor), Koptyug V.A.,
Atlas of Spectra of Aromatic and Heterocyclic Compounds, 1982, 22, 6. [all data]
Llobera and García-Raso, 1987
Llobera, A.; García-Raso, A.,
Gas chromatographic behaviour of several p-quinones,
J. Chromatogr., 1987, 393, 2, 305-311, https://doi.org/10.1016/S0021-9673(01)94227-X
. [all data]