Ethanedioic acid, dimethyl ester
- Formula: C4H6O4
- Molecular weight: 118.0880
- IUPAC Standard InChIKey: LOMVENUNSWAXEN-UHFFFAOYSA-N
- CAS Registry Number: 553-90-2
- Chemical structure:

Condensed phase thermochemistry data

Data compiled by: Hussein Y. Afeefy, Joel F. Liebman, and Stephen E. Stein
Quantity | Value | Units | Method | Reference | Comment |
---|---|---|---|---|---|
ΔfH°solid | -180.76 ± 0.20 | kcal/mol | Ccb | Anthoney, Carson, et al., 1976 | See Anthoney, Carson, et al., 1975 |
ΔfH°solid | -180.86 ± 0.074 | kcal/mol | Cm | Anthoney, Finch, et al., 1975 | Hydrolysis |
Quantity | Value | Units | Method | Reference | Comment |
ΔcH°solid | -400.39 ± 0.15 | kcal/mol | Ccb | Anthoney, Carson, et al., 1976 | See Anthoney, Carson, et al., 1975; Corresponding ΔfHºsolid = -180.76 kcal/mol (simple calculation by NIST; no Washburn corrections) |
ΔcH°solid | -400.8 | kcal/mol | Ccb | Verkade, Coops, et al., 1926 | Heat of combustion at 15°C; Corresponding ΔfHºsolid = -180.3 kcal/mol (simple calculation by NIST; no Washburn corrections) |

Phase change data

Data compiled as indicated in comments:
BS - Robert L. Brown and Stephen E. Stein
TRC - Thermodynamics Research Center, NIST Boulder Laboratories, Chris Muzny director
AC - William E. Acree, Jr., James S. Chickos
ALS - Hussein Y. Afeefy, Joel F. Liebman, and Stephen E. Stein
DRB - Donald R. Burgess, Jr.
Quantity | Value | Units | Method | Reference | Comment |
---|---|---|---|---|---|
Tboil | 437.7 | K | N/A | Weast and Grasselli, 1989 | BS |
Tboil | 437.4 | K | N/A | Lecat, 1927 | Uncertainty assigned by TRC = 0.5 K; TRC |
Tboil | 437.4 | K | N/A | Lecat, 1926 | Uncertainty assigned by TRC = 0.5 K; TRC |
Quantity | Value | Units | Method | Reference | Comment |
Tfus | 327.95 | K | N/A | Anthoney, Carson, et al., 1976, 2 | Uncertainty assigned by TRC = 0.25 K; TRC |
Tfus | 322.65 | K | N/A | Bruner, 1894 | Uncertainty assigned by TRC = 0.6 K; TRC |
Quantity | Value | Units | Method | Reference | Comment |
Tc | 628. | K | N/A | Stern and Kay, 1957 | Uncertainty assigned by TRC = 8. K; TRC |
Tc | 533. | K | N/A | Weger, 1883 | Uncertainty assigned by TRC = 40. K; TRC |
Tc | 533. | K | N/A | Regnault, 1862 | Uncertainty assigned by TRC = 40. K; TRC |
Quantity | Value | Units | Method | Reference | Comment |
Pc | 39.28 | atm | N/A | Stern and Kay, 1957 | Uncertainty assigned by TRC = 4.000 atm; TRC |
Pc | 94.84 | atm | N/A | Regnault, 1862 | Uncertainty assigned by TRC = 20.000 atm; TRC |
Quantity | Value | Units | Method | Reference | Comment |
ΔvapH° | 13.1 ± 0.07 | kcal/mol | GS | Verevkin, Kozlova, et al., 2006 | Based on data from 330. to 365. K.; AC |
ΔvapH° | 12.5 | kcal/mol | N/A | Ma, Liu, et al., 2004 | Based on data from 328. to 443. K. See also Verevkin, Kozlova, et al., 2006.; AC |
Quantity | Value | Units | Method | Reference | Comment |
ΔsubH° | 18.0 ± 0.1 | kcal/mol | C | Chickos, Sabbah, et al., 1996 | ALS |
ΔsubH° | 17.8 ± 0.2 | kcal/mol | C | Chickos, Sabbah, et al., 1996 | AC |
ΔsubH° | 18.0 ± 0.38 | kcal/mol | N/A | Chickos, Sabbah, et al., 1996 | AC |
ΔsubH° | 11.2 | kcal/mol | N/A | Anthoney, Carson, et al., 1976 | DRB |
Enthalpy of vaporization
ΔvapH (kcal/mol) | Temperature (K) | Method | Reference | Comment |
---|---|---|---|---|
10.7 | 416. | HG,EB | Askonas and Daubert, 1988 | Based on data from 347. to 485. K.; AC |
11.7 | 308. | A | Stephenson and Malanowski, 1987 | Based on data from 293. to 437. K. See also Stull, 1947.; AC |
Antoine Equation Parameters
log10(P) = A − (B / (T + C))
P = vapor pressure (atm)
T = temperature (K)
View plot Requires a JavaScript / HTML 5 canvas capable browser.
Temperature (K) | A | B | C | Reference | Comment |
---|---|---|---|---|---|
293. to 436.5 | 5.04014 | 1994.334 | -41.204 | Stull, 1947 | Coefficents calculated by NIST from author's data. |
Enthalpy of sublimation
ΔsubH (kcal/mol) | Temperature (K) | Method | Reference | Comment |
---|---|---|---|---|
18.1 ± 0.38 | 283. | HSA | Chickos, Sabbah, et al., 1996 | Based on data from 268. to 298. K.; AC |
11.33 ± 0.11 | 289.21 | V | Anthoney, Carson, et al., 1976 | See Anthoney, Carson, et al., 1975; ALS |
Enthalpy of fusion
ΔfusH (kcal/mol) | Temperature (K) | Reference | Comment |
---|---|---|---|
5.036 | 327.6 | Acree, 1991 | AC |

Reaction thermochemistry data

Data compiled by: Hussein Y. Afeefy, Joel F. Liebman, and Stephen E. Stein
Individual Reactions
By formula: C4H6O4 + 2H2O = C2H2O4 + 2CH4O
Quantity | Value | Units | Method | Reference | Comment |
---|---|---|---|---|---|
ΔrH° | 4.165 ± 0.016 | kcal/mol | Cm | Anthoney, Finch, et al., 1975 | solid phase; solvent: Water; Hydrolysis |

Gas phase ion energetics data

Data compiled by: Sharon G. Lias, Rhoda D. Levin, and Sherif A. Kafafi
Ionization energy determinations
IE (eV) | Method | Reference | Comment |
---|---|---|---|
10.0 | PE | McGlynn and Meeks, 1976 | |
10.30 | PE | McGlynn and Meeks, 1976 | Vertical value |

Kovats' RI, non-polar column, isothermal

Column type | Active phase | Temperature (C) | I | Reference | Comment |
---|---|---|---|---|---|
Capillary | SE-54 | 140. | 824. | Grigor'eva, Vasil'ev, et al., 1993 | 15. m/0.28 mm/2.4 μm, Ar |
Capillary | SE-54 | 160. | 819. | Grigor'eva, Vasil'ev, et al., 1993 | 15. m/0.28 mm/2.4 μm, Ar |
Capillary | SE-54 | 180. | 817. | Grigor'eva, Vasil'ev, et al., 1993 | 15. m/0.28 mm/2.4 μm, Ar |

Kovats' RI, polar column, isothermal

Column type | Active phase | Temperature (C) | I | Reference | Comment |
---|---|---|---|---|---|
Capillary | PEG-40M | 120. | 1382. | Grigor'eva, Vasil'ev, et al., 1993 | 40. m/0.25 mm/0.10 μm, Ar |
Capillary | PEG-40M | 120. | 1389. | Grigor'eva, Vasil'ev, et al., 1993 | 40. m/0.25 mm/0.10 μm, Ar |

Van Den Dool and Kratz RI, non-polar column, temperature ramp

Column type | Active phase | I | Reference | Comment |
---|---|---|---|---|
Capillary | DB-5 | 826. | Wu, Zorn, et al., 2007 | 30. m/0.32 mm/0.25 μm, He, 40. C @ 2. min, 5. K/min, 250. C @ 5. min |
Packed | SE-30 | 837. | van den Dool and Kratz, 1963 | Celite; Tstart: 75. C; Tend: 228. C |

Van Den Dool and Kratz RI, non-polar column, custom temperature program

Column type | Active phase | I | Reference | Comment |
---|---|---|---|---|
Packed | SE-30 | 800. | Peng, Ding, et al., 1988 | Supelcoport; Chromosorb; Column length: 3.05 m; Program: 40C(5min) => 10C/min => 200C or 250C (60min) |

Van Den Dool and Kratz RI, polar column, temperature ramp

Column type | Active phase | I | Reference | Comment |
---|---|---|---|---|
Capillary | ZB-Wax | 1409. | Wu, Zorn, et al., 2007 | 30. m/0.32 mm/0.25 μm, He, 40. C @ 2. min, 5. K/min, 250. C @ 5. min |
Packed | Carbowax 20M | 1382. | van den Dool and Kratz, 1963 | Celite 545, 4.6 K/min; Tstart: 75. C; Tend: 228. C |

Normal alkane RI, non-polar column, temperature ramp

Column type | Active phase | I | Reference | Comment |
---|---|---|---|---|
Capillary | HP-5 | 800. | N/A | 30. m/0.32 mm/0.25 μm, Helium, 40. C @ 2. min, 5. K/min, 250. C @ 5. min |
Capillary | HP-5 | 826. | N/A | 30. m/0.32 mm/0.25 μm, Helium, 40. C @ 2. min, 5. K/min, 250. C @ 5. min |
Capillary | DB-5 | 800. | Wu, Krings, et al., 2005 | 30. m/0.32 mm/0.25 μm, He, 40. C @ 2. min, 5. K/min, 250. C @ 10. min |

Normal alkane RI, polar column, temperature ramp

Column type | Active phase | I | Reference | Comment |
---|---|---|---|---|
Capillary | ZB-Wax | 1395. | N/A | 30. m/0.32 mm/0.25 μm, Helium, 40. C @ 2. min, 5. K/min, 250. C @ 5. min |
Capillary | ZB-Wax | 1409. | N/A | 30. m/0.32 mm/0.25 μm, Helium, 40. C @ 2. min, 5. K/min, 250. C @ 5. min |
Capillary | ZB-Wax | 1395. | Wu, Krings, et al., 2005 | 30. m/0.32 mm/0.25 μm, He, 40. C @ 2. min, 5. K/min, 250. C @ 10. min |

Gas phase thermochemistry data

Data compiled as indicated in comments:
ALS - Hussein Y. Afeefy, Joel F. Liebman, and Stephen E. Stein
DRB - Donald R. Burgess, Jr.

Quantity Value Units Method Reference Comment
Δfgas-709.27 ± 0.54kJ/molCcbAnthoney, Carson, et al., 1976See Anthoney, Carson, et al., 1975; ALS
Δfgas-709.7kJ/molN/AAnthoney, Finch, et al., 1975Value computed using ΔfHsolid° value of -756.7±0.3 kj/mol from Anthoney, Finch, et al., 1975 and ΔsubH° value of 47.0 kj/mol from Anthoney, Carson, et al., 1976.; DRB

References

Anthoney, Carson, et al., 1976
Anthoney, M.E.; Carson, A.S.; Laye, P.G.; Yrekli, M.,
The enthalpy of formation of dimethyl oxalate,
J. Chem. Thermodyn., 1976, 8, 1009-1010. [all data]
Anthoney, Carson, et al., 1975
Anthoney, M.E.; Carson, A.S.; Laye, P.G.,
The thermochemistry of formates and oxalates,
Conf. Int. Thermodyn. Chim. C.R. 4th, 1975, 1, 99-103. [all data]
Anthoney, Finch, et al., 1975
Anthoney, M.E.; Finch, A.; Stephens, M.,
The solution of dimethyl oxalate and oxalic acid in water and alkali. Standard enthalpy of formation of dimethyl oxalate,
Thermochim. Acta, 1975, 12, 427-431. [all data]
Verkade, Coops, et al., 1926
Verkade, P.E.; Coops, J.; Hartman, H.,
Calorimetric researches. XIII. Heats of combustion of successive terms of homologous series: Dimethyl esters of the oxalic acid series. A general survey of the oscillation phenomena,
Recl. Trav. Chim. Pays-Bas, 1926, 45, 585-606. [all data]
Weast and Grasselli, 1989
CRC Handbook of Data on Organic Compounds, 2nd Editon, Weast,R.C and Grasselli, J.G., ed(s)., CRC Press, Inc., Boca Raton, FL, 1989, 1. [all data]
Lecat, 1927
Lecat, M.,
New binary azeotropes: 6th list,
Ann. Soc. Sci. Bruxelles, Ser. B, 1927, 47, 63-71. [all data]
Lecat, 1926
Lecat, M.,
New binary azeotropes: 3rd list,
Ann. Soc. Sci. Bruxelles, Ser. B, 1926, 45, 284-94. [all data]
Anthoney, Carson, et al., 1976, 2
Anthoney, M.E.; Carson, A.S.; Carson, P.G.; Laye, P.G.; Yurckli, M.,
J. Chem. Thermodyn., 1976, 8, 1009. [all data]
Bruner, 1894
Bruner, L.,
The heats of fusion of some organic compounds,
Ber. Dtsch. Chem. Ges., 1894, 27, 2102. [all data]
Stern and Kay, 1957
Stern, S.A.; Kay, W.B.,
The Critical Pressure and Temperature of Dimethyl Oxalate,
J. Phys. Chem., 1957, 61, 374. [all data]
Weger, 1883
Weger, F.,
Justus Liebigs Ann. Chem., 1883, 221, 61. [all data]
Regnault, 1862
Regnault, V.,
Mem. Acad. Sci. Inst. Fr., 1862, 26, 335. [all data]
Verevkin, Kozlova, et al., 2006
Verevkin, Sergey P.; Kozlova, Svetlana A.; Emel'yanenko, Vladimir N.; Nikitin, Eugene D.; Popov, Alexander P.; Krasnykh, Eugen L.,
Vapor Pressures, Enthalpies of Vaporization, and Critical Parameters of a Series of Linear Aliphatic Dimethyl Esters of Dicarboxylic Acids,
J. Chem. Eng. Data, 2006, 51, 5, 1896-1905, https://doi.org/10.1021/je0602418
. [all data]
Ma, Liu, et al., 2004
Ma, Xin-Bin; Liu, Xin-Gang; Li, Zhen-Hua; Xu, Gen-Hui,
Vapor--liquid equilibria for the ternary system methanol + dimethyl carbonate + dimethyl oxalate and constituent binary systems at different temperatures,
Fluid Phase Equilibria, 2004, 221, 1-2, 51-56, https://doi.org/10.1016/j.fluid.2004.04.018
. [all data]
Chickos, Sabbah, et al., 1996
Chickos, J.S.; Sabbah, R.; Hosseini, S.; Liebman, J.F.,
The sublimation enthalpy of dimethyl oxalate,
Struct. Chem., 1996, 7, 391-395. [all data]
Askonas and Daubert, 1988
Askonas, Charles F.; Daubert, Thomas E.,
Vapor pressure determination of eight oxygenated compounds,
J. Chem. Eng. Data, 1988, 33, 3, 225-229, https://doi.org/10.1021/je00053a001
. [all data]
Stephenson and Malanowski, 1987
Stephenson, Richard M.; Malanowski, Stanislaw,
Handbook of the Thermodynamics of Organic Compounds, 1987, https://doi.org/10.1007/978-94-009-3173-2
. [all data]
Stull, 1947
Stull, Daniel R.,
Vapor Pressure of Pure Substances. Organic and Inorganic Compounds,
Ind. Eng. Chem., 1947, 39, 4, 517-540, https://doi.org/10.1021/ie50448a022
. [all data]
Acree, 1991
Acree, William E.,
Thermodynamic properties of organic compounds: enthalpy of fusion and melting point temperature compilation,
Thermochimica Acta, 1991, 189, 1, 37-56, https://doi.org/10.1016/0040-6031(91)87098-H
. [all data]
McGlynn and Meeks, 1976
McGlynn, S.P.; Meeks, J.L.,
Photoelectron spectra of carbonyls, carbonates, oxalates and esterification effects,
J. Electron Spectrosc. Relat. Phenom., 1976, 8, 85. [all data]
Grigor'eva, Vasil'ev, et al., 1993
Grigor'eva, D.N.; Vasil'ev, A.V.; Golovnya, R.V.,
Effect of the temperature on the retention indices in homologous series of bifunctional compounds under capillary gas chromatography conditions,
J. Anal. Chem. USSR (Engl. Transl.), 1993, 48, 7, 817-822. [all data]
Wu, Zorn, et al., 2007
Wu, S.; Zorn, H.; Krings, U.; Berger, R.G.,
Volatiles from submerged and surface-cultured beefsteak fungus, Fistulina hepatica,
Flavour Fragr. J., 2007, 22, 1, 53-60, https://doi.org/10.1002/ffj.1758
. [all data]
van den Dool and Kratz, 1963
van den Dool, H.; Kratz, P. Dec.,
A generalization of the retention index system including linear temperature programmed gas-liquid partition chromatography,
J. Chromatogr., 1963, 11, 463-471, https://doi.org/10.1016/S0021-9673(01)80947-X
. [all data]
Peng, Ding, et al., 1988
Peng, C.T.; Ding, S.F.; Hua, R.L.; Yang, Z.C.,
Prediction of Retention Indexes I. Structure-Retention Index Relationship on Apolar Columns,
J. Chromatogr., 1988, 436, 137-172, https://doi.org/10.1016/S0021-9673(00)94575-8
. [all data]
Wu, Krings, et al., 2005
Wu, S.; Krings, U.; Zorn, H.; Berger, R.G.,
Volatile compounds from the fruiting bodies of beefsteak fungus Fistulina hepatica (Schaeffer: Fr.) Fr.,
Food Chem., 2005, 92, 2, 221-226, https://doi.org/10.1016/j.foodchem.2004.07.013
. [all data]