Chromium,pentacarbonyl(thiazole-N3)-
- Formula: C8H3CrNO5S
- Molecular weight: 277.174
- CAS Registry Number: 55293-31-7

Phase change data

Data compiled by: William E. Acree, Jr., James S. Chickos
Enthalpy of sublimation
ΔsubH (kJ/mol) | Temperature (K) | Method | Reference | Comment |
---|---|---|---|---|
102.0 ± 2.7 | 286. | ME | Daamen, Ernsting, et al., 1979 | Based on data from 270. to 301. K. |

Gas phase ion energetics data

Data compiled by: Sharon G. Lias, Rhoda D. Levin, and Sherif A. Kafafi
Ionization energy determinations
IE (eV) | Method | Reference | Comment |
---|---|---|---|
7.36 | PE | Daamen, Oskam, et al., 1979 | Vertical value |

References

Daamen, Ernsting, et al., 1979
Daamen, H.; Ernsting, J.M.; Oskam, A.,
Vapour pressure measurements on M(CO)5L (M = Cr, Mo, W; L = piperidine, pyridine, pyrazine, pyrazole, thiazole),
Thermochimica Acta, 1979, 33, 217-223, https://doi.org/10.1016/0040-6031(79)87044-6
. [all data]
Daamen, Oskam, et al., 1979
Daamen, H.; Oskam, A.; Stufkens, D.J.; Waaijers, H.W.,
Bonding properties of group VIB metal pentacarbonyl azole complexes studied by electronic absorption, photoelectron, 13C NMR and vibrational spectroscopy,
Inorg. Chim. Acta, 1979, 34, 253. [all data]