Eicosane, 10-butyl-10-propyl-
- Formula: C27H56
- Molecular weight: 380.7335
- IUPAC Standard InChIKey: OBTFKVMSPBZBQP-UHFFFAOYSA-N
- CAS Registry Number: 55282-33-2
- Chemical structure:

Phase change data

Data compiled by: Thermodynamics Research Center, NIST Boulder Laboratories, Chris Muzny director
Quantity | Value | Units | Method | Reference | Comment |
---|---|---|---|---|---|
Tfus | 197. | K | N/A | Rabjohn, 1955 | Uncertainty assigned by TRC = 3. K |

References

Rabjohn, 1955
Rabjohn, N.,
Unpublished, Univ. of Missouri, Columbus, 1955. [all data]