Dipropyldiazene, trans
- Formula: C6H14N2
- Molecular weight: 114.1888
- IUPAC Standard InChIKey: LQCYZZANGSLXDJ-UHFFFAOYSA-N
- CAS Registry Number: 55204-42-7
- Chemical structure:
View 3d structure (requires JavaScript / HTML 5) - Species with the same structure:
- Stereoisomers:
- Other names: (E)-1,2-Dipropyldiazene

Gas phase ion energetics data

Data compiled as indicated in comments:
LLK - Sharon G. Lias, Rhoda D. Levin, and Sherif A. Kafafi
Ionization energy determinations
IE (eV) | Method | Reference | Comment |
---|---|---|---|
8.1 | PE | Houk, Chang, et al., 1975 | LLK |
8.61 | PE | Houk, Chang, et al., 1975 | Vertical value; LLK |

References

Houk, Chang, et al., 1975
Houk, K.N.; Chang, Y.-M.; Engel, P.S.,
Photoelectron spectroscopy of azo compounds,
J. Am. Chem. Soc., 1975, 97, 1824. [all data]