Benzene, 1,2,3,4-tetrafluoro-
- Formula: C6H2F4
- Molecular weight: 150.0737
- IUPAC Standard InChIKey: SOZFIIXUNAKEJP-UHFFFAOYSA-N
- CAS Registry Number: 551-62-2
- Chemical structure:
View 3d structure (requires JavaScript / HTML 5) - Other names: 1,2,3,4-Tetrafluorobenzene; 2,3,4,5-Tetrafluorobenzene

Condensed phase thermochemistry data

Data compiled by: Eugene S. Domalski and Elizabeth D. Hearing
Quantity | Value | Units | Method | Reference | Comment |
---|---|---|---|---|---|
S°liquid | 256.1 | J/mol*K | N/A | Andon and Martin, 1973 |
Constant pressure heat capacity of liquid
Cp,liquid (J/mol*K) | Temperature (K) | Reference | Comment |
---|---|---|---|
189.9 | 298.15 | Andon and Martin, 1973 | T = 10 to 320 K. |

Phase change data

Data compiled as indicated in comments:
BS - Robert L. Brown and Stephen E. Stein
TRC - Thermodynamics Research Center, NIST Boulder Laboratories, Chris Muzny director
AC - William E. Acree, Jr., James S. Chickos
DH - Eugene S. Domalski and Elizabeth D. Hearing
Quantity | Value | Units | Method | Reference | Comment |
---|---|---|---|---|---|
Tboil | 368.2 | K | N/A | Aldrich Chemical Company Inc., 1990 | BS |
Tboil | 368. | K | N/A | PCR Inc., 1990 | BS |
Tboil | 366.7 | K | N/A | Weast and Grasselli, 1989 | BS |
Quantity | Value | Units | Method | Reference | Comment |
Ttriple | 231.25 | K | N/A | Andon and Martin, 1973, 2 | Crystal phase 2 phase; Uncertainty assigned by TRC = 0.02 K; TRC |
Ttriple | 233.26 | K | N/A | Andon and Martin, 1973, 2 | Crystal phase 1 phase; Uncertainty assigned by TRC = 0.02 K; TRC |
Quantity | Value | Units | Method | Reference | Comment |
Tc | 550.83 | K | N/A | Ambrose, Broderick, et al., 1974 | Uncertainty assigned by TRC = 0.2 K; TRC |
Tc | 550.83 | K | N/A | Hales and Townsend, 1974 | Uncertainty assigned by TRC = 0.05 K; TRC |
Quantity | Value | Units | Method | Reference | Comment |
Pc | 37.91 | bar | N/A | Ambrose, Broderick, et al., 1974 | Uncertainty assigned by TRC = 0.04 bar; TRC |
Quantity | Value | Units | Method | Reference | Comment |
ρc | 3.196 | mol/l | N/A | Hales and Townsend, 1974 | Uncertainty assigned by TRC = 0.0031 mol/l; Liquid density determined by magnetically balanced float up to 490 K, see J.L.Hales, 1970. Critical D by equation due to Riedel.; TRC |
Quantity | Value | Units | Method | Reference | Comment |
ΔvapH° | 37.5 | kJ/mol | N/A | Boublik, Fried, et al., 1984 | Based on data from 300. to 390. K. See also Basarová and Svoboda, 1991.; AC |
Enthalpy of vaporization
ΔvapH (kJ/mol) | Temperature (K) | Method | Reference | Comment |
---|---|---|---|---|
36.8 | 315. | A | Stephenson and Malanowski, 1987 | Based on data from 300. to 392. K. See also Ambrose, Ellender, et al., 1975 and Boublik, Fried, et al., 1984.; AC |
37.0 | 294. | MM | Stephenson and Malanowski, 1987 | Based on data from 279. to 323. K. See also Findlay, 1969.; AC |
Antoine Equation Parameters
log10(P) = A − (B / (T + C))
P = vapor pressure (bar)
T = temperature (K)
View plot Requires a JavaScript / HTML 5 canvas capable browser.
Temperature (K) | A | B | C | Reference | Comment |
---|---|---|---|---|---|
279.20 to 323.02 | 4.31735 | 1394.889 | -44.425 | Findlay, 1969 | Coefficents calculated by NIST from author's data. |
Enthalpy of fusion
ΔfusH (kJ/mol) | Temperature (K) | Reference | Comment |
---|---|---|---|
10.93 | 233.3 | Andon and Martin, 1973, 2 | AC |
Enthalpy of phase transition
ΔHtrs (kJ/mol) | Temperature (K) | Initial Phase | Final Phase | Reference | Comment |
---|---|---|---|---|---|
4.900 | 221. | crystaline, II | crystaline, I | Andon and Martin, 1973 | DH |
6.180 | 231.25 | crystaline, II | liquid | Andon and Martin, 1973 | DH |
10.930 | 233.26 | crystaline, I | liquid | Andon and Martin, 1973 | DH |
Entropy of phase transition
ΔStrs (J/mol*K) | Temperature (K) | Initial Phase | Final Phase | Reference | Comment |
---|---|---|---|---|---|
22.2 | 221. | crystaline, II | crystaline, I | Andon and Martin, 1973 | DH |
26.7 | 231.25 | crystaline, II | liquid | Andon and Martin, 1973 | DH |
46.9 | 233.26 | crystaline, I | liquid | Andon and Martin, 1973 | DH |

Reaction thermochemistry data

Data compiled as indicated in comments:
B - John E. Bartmess
RCD - Robert C. Dunbar
Individual Reactions
C6HF4- + =
By formula: C6HF4- + H+ = C6H2F4
Quantity | Value | Units | Method | Reference | Comment |
---|---|---|---|---|---|
ΔrH° | 1547. ± 8.8 | kJ/mol | G+TS | Buker, Nibbering, et al., 1997 | gas phase; B |
Quantity | Value | Units | Method | Reference | Comment |
ΔrG° | 1513. ± 8.4 | kJ/mol | IMRE | Buker, Nibbering, et al., 1997 | gas phase; B |
By formula: Cr+ + C6H2F4 = (Cr+ • C6H2F4)
Quantity | Value | Units | Method | Reference | Comment |
---|---|---|---|---|---|
ΔrH° | 106. | kJ/mol | RAK | Ryzhov, 1999 | RCD |
Quantity | Value | Units | Method | Reference | Comment |
ΔrS° | 5.1672×10+6 | J/mol*K | RAK | Ryzhov, 1999 | RCD |

Gas phase ion energetics data

Data evaluated as indicated in comments:
HL - Edward P. Hunter and Sharon G. Lias
L - Sharon G. Lias
Data compiled as indicated in comments:
B - John E. Bartmess
LLK - Sharon G. Lias, Rhoda D. Levin, and Sherif A. Kafafi
RDSH - Henry M. Rosenstock, Keith Draxl, Bruce W. Steiner, and John T. Herron
Quantity | Value | Units | Method | Reference | Comment |
---|---|---|---|---|---|
IE (evaluated) | 9.57 ± 0.03 | eV | N/A | N/A | L |
Quantity | Value | Units | Method | Reference | Comment |
Proton affinity (review) | 700.4 | kJ/mol | N/A | Hunter and Lias, 1998 | HL |
Quantity | Value | Units | Method | Reference | Comment |
Gas basicity | 672.7 | kJ/mol | N/A | Hunter and Lias, 1998 | HL |
Ionization energy determinations
IE (eV) | Method | Reference | Comment |
---|---|---|---|
9.60 | PE | Sell, Mintz, et al., 1978 | LLK |
9.532 ± 0.004 | EQ | Lias and Ausloos, 1978 | LLK |
9.61 | PI | Bralsford, Harris, et al., 1960 | RDSH |
9.56 | PE | Streets and Ceasar, 1973 | Vertical value; LLK |
De-protonation reactions
C6HF4- + =
By formula: C6HF4- + H+ = C6H2F4
Quantity | Value | Units | Method | Reference | Comment |
---|---|---|---|---|---|
ΔrH° | 1547. ± 8.8 | kJ/mol | G+TS | Buker, Nibbering, et al., 1997 | gas phase; B |
Quantity | Value | Units | Method | Reference | Comment |
ΔrG° | 1513. ± 8.4 | kJ/mol | IMRE | Buker, Nibbering, et al., 1997 | gas phase; B |

Ion clustering data

Data compiled by: Robert C. Dunbar
Clustering reactions
By formula: Cr+ + C6H2F4 = (Cr+ • C6H2F4)
Quantity | Value | Units | Method | Reference | Comment |
---|---|---|---|---|---|
ΔrH° | 106. | kJ/mol | RAK | Ryzhov, 1999 | |
Quantity | Value | Units | Method | Reference | Comment |
ΔrS° | 5.1672×10+6 | J/mol*K | RAK | Ryzhov, 1999 |

References

Andon and Martin, 1973
Andon, R.J.L.; Martin, J.F.,
Thermodynamic properties of fluorine compounds. Part 11. Low-temperature heat capacities of the three tetrafluorobenzenes,
J. Chem. Soc. Faraday Trans., 1973, I 69, 761-770. [all data]
Aldrich Chemical Company Inc., 1990
Aldrich Chemical Company Inc.,
Catalog Handbook of Fine Chemicals, Aldrich Chemical Company, Inc., Milwaukee WI, 1990, 1. [all data]
PCR Inc., 1990
PCR Inc.,
Research Chemicals Catalog 1990-1991, PCR Inc., Gainesville, FL, 1990, 1. [all data]
Weast and Grasselli, 1989
CRC Handbook of Data on Organic Compounds, 2nd Editon, Weast,R.C and Grasselli, J.G., ed(s)., CRC Press, Inc., Boca Raton, FL, 1989, 1. [all data]
Andon and Martin, 1973, 2
Andon, R.J.L.; Martin, J.F.,
Thermodynamic properties of fluorine compounds. Part 11.---Low-temperature heat capacities of the three tetrafluorobenzenes,
J. Chem. Soc., Faraday Trans. 1, 1973, 69, 0, 761, https://doi.org/10.1039/f19736900761
. [all data]
Ambrose, Broderick, et al., 1974
Ambrose, D.; Broderick, B.E.; Townsend, R.,
The Critical Temperatures and Pressures of Thirty Organic Compounds,
J. Appl. Chem. Biotechnol., 1974, 24, 359. [all data]
Hales and Townsend, 1974
Hales, J.L.; Townsend, R.,
Liquid Densities from 293 to 490 K of Eight Fluorinated Aromatic Comp.,
J. Chem. Thermodyn., 1974, 6, 111-6. [all data]
Boublik, Fried, et al., 1984
Boublik, T.; Fried, V.; Hala, E.,
The Vapour Pressures of Pure Substances: Selected Values of the Temperature Dependence of the Vapour Pressures of Some Pure Substances in the Normal and Low Pressure Region, 2nd ed., Elsevier, New York, 1984, 972. [all data]
Basarová and Svoboda, 1991
Basarová, Pavlína; Svoboda, Václav,
Calculation of heats of vaporization of halogenated hydrocarbons from saturated vapour pressure data,
Fluid Phase Equilibria, 1991, 68, 13-34, https://doi.org/10.1016/0378-3812(91)85008-I
. [all data]
Stephenson and Malanowski, 1987
Stephenson, Richard M.; Malanowski, Stanislaw,
Handbook of the Thermodynamics of Organic Compounds, 1987, https://doi.org/10.1007/978-94-009-3173-2
. [all data]
Ambrose, Ellender, et al., 1975
Ambrose, D.; Ellender, J.H.; Sprake, C.H.S.; Townsend, R.,
Thermodynamic properties of fluorine compounds. Part 15.---Vapour pressures of the three tetrafluorobenzenes and 1,3,5-trichloro-2,4,6-trifluorobenzene,
J. Chem. Soc., Faraday Trans. 1, 1975, 71, 0, 35, https://doi.org/10.1039/f19757100035
. [all data]
Findlay, 1969
Findlay, T.J.V.,
Vapor pressures of fluorobenzenes from 5 to 50.deg.C,
J. Chem. Eng. Data, 1969, 14, 2, 229-231, https://doi.org/10.1021/je60041a012
. [all data]
Buker, Nibbering, et al., 1997
Buker, H.H.; Nibbering, N.M.M.; Espinosa, D.; Mongin, F.; Schlosser, M.,
Additivity of substituent effects in the fluoroarene series: Equilibrium acidity in the gas phase and deprotonation rates in ethereal solution,
Tetrahed. Lett., 1997, 38, 49, 8519-8522, https://doi.org/10.1016/S0040-4039(97)10303-3
. [all data]
Ryzhov, 1999
Ryzhov, V.,
Binding Energies of Chromium Cations with Fluorobenzenes from Radiative Association Kinetics,
Int. J. Mass Spectrom., 1999, 185/186/187, 913. [all data]
Hunter and Lias, 1998
Hunter, E.P.; Lias, S.G.,
Evaluated Gas Phase Basicities and Proton Affinities of Molecules: An Update,
J. Phys. Chem. Ref. Data, 1998, 27, 3, 413-656, https://doi.org/10.1063/1.556018
. [all data]
Sell, Mintz, et al., 1978
Sell, J.A.; Mintz, D.M.; Kupperman, A.,
Photoelectron angular distributions of carbon-carbon π electrons in ethylene, benzene, and their fluorinated derivatives,
Chem. Phys. Lett., 1978, 58, 601. [all data]
Lias and Ausloos, 1978
Lias, S.G.; Ausloos, P.J.,
eIonization energies of organic compounds by equilibrium measurements,
J. Am. Chem. Soc., 1978, 100, 6027. [all data]
Bralsford, Harris, et al., 1960
Bralsford, R.; Harris, P.V.; Price, W.C.,
The effect of fluorine on the electronic spectra and ionization potentials of molecules,
Proc. Roy. Soc. (London), 1960, A258, 459. [all data]
Streets and Ceasar, 1973
Streets, D.G.; Ceasar, G.P.,
Inductive mesomeric effects on the π orbitals of halobenzenes,
Mol. Phys., 1973, 26, 1037. [all data]