2-Azabicyclo[2.2.2]octane,2-methyl-
- Formula: C8H15N
- Molecular weight: 125.2114
- IUPAC Standard InChIKey: NEELGKCJSWYRLI-UHFFFAOYSA-N
- CAS Registry Number: 55100-40-8
- Chemical structure:
View 3d structure (requires JavaScript / HTML 5) - Permanent link for this species. Use this link for bookmarking this species for future reference.

Gas phase ion energetics data

Data compiled by: Sharon G. Lias, Rhoda D. Levin, and Sherif A. Kafafi
Ionization energy determinations
IE (eV) | Method | Reference | Comment |
---|---|---|---|
7.78 ± 0.05 | PE | Morishima, Yoshikawa, et al., 1975 | Vertical value |

References

Morishima, Yoshikawa, et al., 1975
Morishima, I.; Yoshikawa, K.; Hashimoto, M.; Bekki, K.,
Homoallylic interaction between the nitrogen lone pair and the nonadjacent π bond in cyclic and bicyclic amines. I. Photoelectron spectroscopic study,
J. Am. Chem. Soc., 1975, 97, 4283. [all data]