Ethane-d1
- Formula: C2H5D
- Molecular weight: 31.0752
- IUPAC Standard InChIKey: OTMSDBZUPAUEDD-MICDWDOJSA-N
- CAS Registry Number: 5505-49-7
- Chemical structure:
View 3d structure (requires JavaScript / HTML 5) - Isotopologues:

Gas phase ion energetics data

Data compiled by: Henry M. Rosenstock, Keith Draxl, Bruce W. Steiner, and John T. Herron
Ionization energy determinations
IE (eV) | Method | Reference |
---|---|---|
11.58 ± 0.04 | EI | D'Or, Collin, et al., 1966 |
Appearance energy determinations
Ion | AE (eV) | Other Products | Method | Reference | Comment |
---|---|---|---|---|---|
CH2D+ | 14.71 ± 0.30 | CH3 | EI | D'Or, Collin, et al., 1966 | |
CH3+ | 14.94 | ? | EI | D'Or, Collin, et al., 1966 | |
C2H2+ | 15.49 ± 0.25 | H2+HD | EI | D'Or, Collin, et al., 1966 | |
C2H3+ | 15.27 ± 0.15 | ? | EI | D'Or, Collin, et al., 1966 | |
C2H3D+ | 12.36 ± 0.05 | H2 | EI | D'Or, Collin, et al., 1966 | |
C2H4+ | 12.52 ± 0.10 | HD | EI | D'Or, Collin, et al., 1966 | |
C2H4D+ | 12.9 ± 0.1 | H | EI | D'Or, Collin, et al., 1966 |

References

D'Or, Collin, et al., 1966
D'Or, L.; Collin, J.E.; Longree, J.,
Ionisation et dissociation de l'ethane sous l'impact electronique. Spectres de masse et phenomenes d'echange dans C2H6, C2H5D, CH3CD3 et C2D6,
Bull. Classe Sci. Acad. Roy. Belg., 1966, 52, 518. [all data]