1H-Phenalen-1-one
- Formula: C13H8O
- Molecular weight: 180.2020
- IUPAC Standard InChIKey: WWBGWPHHLRSTFI-UHFFFAOYSA-N
- CAS Registry Number: 548-39-0
- Chemical structure:
View 3d structure (requires JavaScript / HTML 5) - Other names: Phenalen-1-one; Perinaphthenone; Phenalenone; 7-Perinaphthenone; Perinaphthanone

Phase change data

Data compiled by: William E. Acree, Jr., James S. Chickos
Enthalpy of sublimation
ΔsubH (kJ/mol) | Temperature (K) | Method | Reference | Comment |
---|---|---|---|---|
97.2 ± 2.5 | 337. | ME | Oja and Suuberg, 1998 | Based on data from 326. to 348. K. |

Gas phase ion energetics data

Data compiled by: Sharon G. Lias, Rhoda D. Levin, and Sherif A. Kafafi
Ionization energy determinations
IE (eV) | Method | Reference | Comment |
---|---|---|---|
8.20 ± 0.04 | PE | Carnovale, Gan, et al., 1979 | Vertical value |

Normal alkane RI, non-polar column, custom temperature program

Column type | Active phase | I | Reference | Comment |
---|---|---|---|---|
Capillary | SLB-5 MS | 1751. | Mondello, 2012 | 30. m/0.25 mm/0.25 μm, Helium; Program: not specified |
Capillary | SLB-5 MS | 1759. | Mondello, 2012 | 30. m/0.25 mm/0.25 μm, Helium; Program: not specified |

Lee's RI, non-polar column, temperature ramp

Column type | Active phase | I | Reference | Comment |
---|---|---|---|---|
Capillary | HP-5 | 320.74 | Pedersen, Durant, et al., 2005 | 30. m/0.25 mm/0.25 μm, Helium, 50. C @ 1.5 min, 6. K/min, 310. C @ 10. min |
Capillary | SPB-5 | 319.7 | Knobloch and Engewald, 1993 | 40. C @ 2. min, 4. K/min; Column length: 30. m; Column diameter: 0.25 mm; Tend: 300. C |
Capillary | SPB-5 | 319.8 | Knobloch and Engewald, 1993 | 40. C @ 2. min, 4. K/min; Column length: 30. m; Column diameter: 0.25 mm; Tend: 300. C |

Lee's RI, non-polar column, custom temperature program

Column type | Active phase | I | Reference | Comment |
---|---|---|---|---|
Capillary | LM-5 | 317.42 | Ré-Poppi and Santiago-Silva, 2005 | 30. m/0.25 mm/0.25 μm, He; Program: 60C(2min) => 15C/min => 180C => 5C/min => 280C (10min) |
Capillary | LM-5 | 317.00 | Ré-Poppi and Santiago-Silva, 2002 | 30. m/0.25 mm/0.25 μm, He; Program: 60C(2min) => 15C/min => 180C => 5C/min => 280C(5min) |

References

Oja and Suuberg, 1998
Oja, Vahur; Suuberg, Eric M.,
Vapor Pressures and Enthalpies of Sublimation of Polycyclic Aromatic Hydrocarbons and Their Derivatives,
J. Chem. Eng. Data, 1998, 43, 3, 486-492, https://doi.org/10.1021/je970222l
. [all data]
Carnovale, Gan, et al., 1979
Carnovale, F.; Gan, T.H.; Peel, J.B.; Franz, K.-D.,
Photoelectron spectroscopic studies of some alkoxy phenalenones,
Tetrahedron, 1979, 35, 129. [all data]
Mondello, 2012
Mondello, L.,
HS-SPME-GCxGC-MS analysis of Yerba Mate (Ilex paraguariensis)
in Shimadzu GC-GC application compendium of comprehensive 2D GC, Vol. 1-5, Shimadzu Corp., 2012, 1-29. [all data]
Pedersen, Durant, et al., 2005
Pedersen, D.U.; Durant, J.L.; Taghizadeh, K.; Hemond, H.F.; Lafleur, A.L.; Cass, G.R.,
Human cell mutagenes in respirable airborne particles from the Northeastern United States. 2. Quantification of mutagenes and other organic compounds.,
Environ. Sci. Technol., 2005, 39, 24, 9547-9560, https://doi.org/10.1021/es050886c
. [all data]
Knobloch and Engewald, 1993
Knobloch, T.; Engewald, W.,
Identification of some polar polycyclic compounds in emissions from brown-coal-fired residential stoves,
J. Hi. Res. Chromatogr., 1993, 16, 4, 239-242, https://doi.org/10.1002/jhrc.1240160407
. [all data]
Ré-Poppi and Santiago-Silva, 2005
Ré-Poppi, N.; Santiago-Silva, M.,
Polycyclic aromatic hydrocarbons and other selected organic compounds in ambient air of Campo Grande City, Brazil,
Atmos. Environ., 2005, 39, 16, 2839-2850, https://doi.org/10.1016/j.atmosenv.2004.10.006
. [all data]
Ré-Poppi and Santiago-Silva, 2002
Ré-Poppi, N.; Santiago-Silva, M.R.,
Identification of polycyclic aromatic hydrocarbons and methoxylated phenols in wood smoke emitted during production of charcoal,
Chromatographia, 2002, 55, 7/8, 475-481, https://doi.org/10.1007/BF02492280
. [all data]