Cu-etioporphyrin-iii

Gas phase ion energetics data

Data compiled by: Sharon G. Lias, Rhoda D. Levin, and Sherif A. Kafafi

Ionization energy determinations

IE (eV) Method Reference Comment
6.0PEDupuis, Roberge, et al., 1980
6.2PEDupuis, Roberge, et al., 1980Vertical value

References

Dupuis, Roberge, et al., 1980
Dupuis, P.; Roberge, R.; Sandorfy, C., The very low ionization potentials of porphyrins and the possible role of rydberg states in photosynthesis, Chem. Phys. Lett., 1980, 75, 434. [all data]