Methyl lactate
- Formula: C4H8O3
- Molecular weight: 104.1045
- IUPAC Standard InChIKey: LPEKGGXMPWTOCB-UHFFFAOYSA-N
- CAS Registry Number: 547-64-8
- Chemical structure:
View 3d structure (requires JavaScript / HTML 5) - Species with the same structure:
- Stereoisomers:
- Other names: Propanoic acid, 2-hydroxy-, methyl ester; Lactic acid, methyl ester; Methyl 2-hydroxypropionate; Methyl ester of 2-hydroxypropanoic acid

Phase change data

Data compiled as indicated in comments:
TRC - Thermodynamics Research Center, NIST Boulder Laboratories, Chris Muzny director
AC - William E. Acree, Jr., James S. Chickos
Quantity | Value | Units | Method | Reference | Comment |
---|---|---|---|---|---|
Tboil | 417.0 | K | N/A | Lecat, 1927 | Uncertainty assigned by TRC = 0.5 K; TRC |
Tboil | 417.0 | K | N/A | Lecat, 1926 | Uncertainty assigned by TRC = 0.5 K; TRC |
Tboil | 417.0 | K | N/A | Lecat, 1926, 2 | Uncertainty assigned by TRC = 0.5 K; TRC |
Enthalpy of vaporization
ΔvapH (kJ/mol) | Temperature (K) | Method | Reference | Comment |
---|---|---|---|---|
44.7 | 328. | A | Stephenson and Malanowski, 1987 | Based on data from 313. to 418. K.; AC |

Gas phase ion energetics data

Data compiled by: Sharon G. Lias and Joel F. Liebman
Appearance energy determinations
Ion | AE (eV) | Other Products | Method | Reference | Comment |
---|---|---|---|---|---|
C2H3O2+ | 10.32 | C2H5O | EI | Holmes, Lossing, et al., 1991 |

References

Lecat, 1927
Lecat, M.,
New binary azeotropes: 7th list,
Ann. Soc. Sci. Bruxelles, Ser. B, 1927, 47, 108-14. [all data]
Lecat, 1926
Lecat, M.,
New binary azeotropes: 3rd list,
Ann. Soc. Sci. Bruxelles, Ser. B, 1926, 45, 284-94. [all data]
Lecat, 1926, 2
Lecat, M.,
New binary azeotropes second list,
Recl. Trav. Chim. Pays-Bas, 1926, 45, 620-627. [all data]
Stephenson and Malanowski, 1987
Stephenson, Richard M.; Malanowski, Stanislaw,
Handbook of the Thermodynamics of Organic Compounds, 1987, https://doi.org/10.1007/978-94-009-3173-2
. [all data]
Holmes, Lossing, et al., 1991
Holmes, J.L.; Lossing, F.P.; Mayer, P.M.,
Heats of formation of oxygen-containing organic free radicals from appearance energy measurements,
J. Am. Chem. Soc., 1991, 113, 9723. [all data]