Methyl isobutyrate
- Formula: C5H10O2
- Molecular weight: 102.1317
- IUPAC Standard InChIKey: BHIWKHZACMWKOJ-UHFFFAOYSA-N
- CAS Registry Number: 547-63-7
- Chemical structure:
View 3d structure (requires JavaScript / HTML 5) - Other names: Propanoic acid, 2-methyl-, methyl ester; Isobutyric acid, methyl ester; Methyl 2-methylpropanoate; Methyl 2-methylpropionate; (CH3)2CHC(O)OCH3; Methyl isobutanoate; Methylester kyseliny isomaselne; Methyl methylpropanoate; NSC 126780

Phase change data

Data compiled as indicated in comments:
BS - Robert L. Brown and Stephen E. Stein
TRC - Thermodynamics Research Center, NIST Boulder Laboratories, Chris Muzny director
ALS - Hussein Y. Afeefy, Joel F. Liebman, and Stephen E. Stein
AC - William E. Acree, Jr., James S. Chickos
Quantity | Value | Units | Method | Reference | Comment |
---|---|---|---|---|---|
Tboil | 365. ± 1. | K | AVG | N/A | Average of 14 out of 17 values; Individual data points |
Quantity | Value | Units | Method | Reference | Comment |
Tfus | 187.15 | K | N/A | Dolliver, Gresham, et al., 1938 | Uncertainty assigned by TRC = 1.5 K; TRC |
Tfus | 188.50 | K | N/A | Timmermans, 1922 | Uncertainty assigned by TRC = 0.25 K; TRC |
Quantity | Value | Units | Method | Reference | Comment |
Tc | 540.70 | K | N/A | Young, 1910 | Uncertainty assigned by TRC = 1. K; TRC |
Tc | 540.70 | K | N/A | Young and Thomas, 1893 | Uncertainty assigned by TRC = 1. K; TRC |
Tc | 546.8 | K | N/A | Pawlewski, 1882 | Uncertainty assigned by TRC = 6. K; TRC |
Quantity | Value | Units | Method | Reference | Comment |
Pc | 33.87 | atm | N/A | Young, 1910 | Uncertainty assigned by TRC = 0.8000 atm; TRC |
Pc | 33.855 | atm | N/A | Young and Thomas, 1893 | Uncertainty assigned by TRC = 0.39 atm; TRC |
Quantity | Value | Units | Method | Reference | Comment |
ρc | 2.949 | mol/l | N/A | Young, 1910 | Uncertainty assigned by TRC = 0.098 mol/l; TRC |
ρc | 2.954 | mol/l | N/A | Young and Thomas, 1893 | Uncertainty assigned by TRC = 0.04 mol/l; TRC |
Quantity | Value | Units | Method | Reference | Comment |
ΔvapH° | 8.944 | kcal/mol | N/A | Majer and Svoboda, 1985 | |
ΔvapH° | 7.98 ± 0.004 | kcal/mol | V | Mathews, 1926 | ALS |
Enthalpy of vaporization
ΔvapH (kcal/mol) | Temperature (K) | Method | Reference | Comment |
---|---|---|---|---|
7.794 | 365.6 | N/A | Majer and Svoboda, 1985 | |
8.05 | 381. | A | Stephenson and Malanowski, 1987 | Based on data from 366. to 533. K.; AC |
9.58 | 254. | A | Stephenson and Malanowski, 1987 | Based on data from 239. to 366. K. See also Stull, 1947.; AC |
Antoine Equation Parameters
log10(P) = A − (B / (T + C))
P = vapor pressure (atm)
T = temperature (K)
View plot Requires a JavaScript / HTML 5 canvas capable browser.
Temperature (K) | A | B | C | Reference | Comment |
---|---|---|---|---|---|
239.1 to 365.8 | 4.57783 | 1499.414 | -38.113 | Stull, 1947 | Coefficents calculated by NIST from author's data. |
365.8 to 532.7 | 4.45967 | 1506.866 | -27.723 | Stull, 1947 | Coefficents calculated by NIST from author's data. |

Reaction thermochemistry data

Data compiled by: Hussein Y. Afeefy, Joel F. Liebman, and Stephen E. Stein
Individual Reactions
By formula: C7H16O3 + H2O = C5H10O2 + 2CH4O
Quantity | Value | Units | Method | Reference | Comment |
---|---|---|---|---|---|
ΔrH° | -7.799 ± 0.017 | kcal/mol | Cm | Wiberg, Martin, et al., 1985 | liquid phase; solvent: Aqueous dioxane |
ΔrH° | -12.72 ± 0.28 | kcal/mol | Eqk | Guthrie and Cullimore, 1980 | liquid phase |
By formula: H2 + C5H8O2 = C5H10O2
Quantity | Value | Units | Method | Reference | Comment |
---|---|---|---|---|---|
ΔrH° | -25.9 ± 1.2 | kcal/mol | Chyd | Vilcu and Perisanu, 1980 | liquid phase |
ΔrH° | -28.64 ± 0.05 | kcal/mol | Chyd | Dolliver, Gresham, et al., 1938, 2 | gas phase; At 355 K |
By formula: C7H16O3 + H2O = C5H10O2 + 2CH4O
Quantity | Value | Units | Method | Reference | Comment |
---|---|---|---|---|---|
ΔrH° | -7.836 ± 0.014 | kcal/mol | Cm | Wiberg, 1980 | liquid phase; solvent: Water; Hydrolysis |
By formula: C5H10O2 + H2O = CH4O + C4H8O2
Quantity | Value | Units | Method | Reference | Comment |
---|---|---|---|---|---|
ΔrH° | -14.72 ± 0.24 | kcal/mol | Eqk | Guthrie and Cullimore, 1980 | liquid phase |

Gas phase ion energetics data

Data evaluated as indicated in comments:
HL - Edward P. Hunter and Sharon G. Lias
Data compiled as indicated in comments:
LBLHLM - Sharon G. Lias, John E. Bartmess, Joel F. Liebman, John L. Holmes, Rhoda D. Levin, and W. Gary Mallard
RDSH - Henry M. Rosenstock, Keith Draxl, Bruce W. Steiner, and John T. Herron
LL - Sharon G. Lias and Joel F. Liebman
Quantity | Value | Units | Method | Reference | Comment |
---|---|---|---|---|---|
Proton affinity (review) | 200.0 | kcal/mol | N/A | Hunter and Lias, 1998 | HL |
Quantity | Value | Units | Method | Reference | Comment |
Gas basicity | 192.6 | kcal/mol | N/A | Hunter and Lias, 1998 | HL |
Ionization energy determinations
IE (eV) | Method | Reference | Comment |
---|---|---|---|
9.86 | PE | Burgers, Holmes, et al., 1983 | LBLHLM |
9.98 ± 0.02 | PI | Watanabe, Nakayama, et al., 1962 | RDSH |
Appearance energy determinations
Ion | AE (eV) | Other Products | Method | Reference | Comment |
---|---|---|---|---|---|
C2H3O2+ | 11.42 | C3H7 | EI | Holmes, Lossing, et al., 1991 | LL |
C4H7O2+ | 10.28 | CH3 | EI | Burgers, Holmes, et al., 1983 | LBLHLM |

Kovats' RI, non-polar column, isothermal

View large format table.

Column type Active phase Temperature (C) I Reference Comment
CapillaryOV-1333.671.Hu, Lu, et al., 2006
PackedApiezon L120.628.Bogoslovsky, Anvaer, et al., 1978Celite 545
PackedApiezon L160.628.Bogoslovsky, Anvaer, et al., 1978Celite 545
PackedSE-30150.665.Ashes and Haken, 1974Celaton (62-72 mesh); Column length: 3.7 m
PackedOV-1150.669.Ashes and Haken, 1971
PackedSqualane50.623.Mira and Sanchez, 1970Chromosorb G
PackedSE-30150.669.Germaine and Haken, 1969Celite 560; Column length: 3.7 m

Kovats' RI, non-polar column, custom temperature program

View large format table.

Column type Active phase I Reference Comment
CapillarySE-30665.Chretien and Dubois, 1978Program: not specified

Kovats' RI, polar column, isothermal

View large format table.

Column type Active phase Temperature (C) I Reference Comment
PackedCarbowax 20M100.915.Chastrette, Heintz, et al., 1974Chromosorb WAW (60-80 mesh); Column length: 3. m

Van Den Dool and Kratz RI, non-polar column, temperature ramp

View large format table.

Column type Active phase I Reference Comment
CapillaryDB-5684.Steinhaus and Schieberle, 200730. m/0.32 mm/0.25 μm, 40. C @ 2. min, 6. K/min, 240. C @ 10. min
CapillaryCP-Sil 8CB-MS685.Hierro, de la Hoz, et al., 200460. m/0.25 mm/0.25 μm, 40. C @ 2. min, 4. K/min, 280. C @ 5. min

Van Den Dool and Kratz RI, non-polar column, custom temperature program

View large format table.

Column type Active phase I Reference Comment
CapillaryRTX-5691.Fuhrmann and Grosch, 2002Program: not specified
CapillaryDB-5690.Beaulieu and Grimm, 200130. m/0.25 mm/0.25 μm, He; Program: 50C (1min) => 5C/min => 100C => 10C/min => 250C (9min)
CapillaryCP Sil 8 CB697.Duckham, Dodson, et al., 200160. m/0.25 mm/0.25 μm; Program: 0C => rapidly => 40C(8min) => 4C/min => 250C(10min)
CapillaryBPX-5684.Bauchot, Mottram, et al., 199850. m/0.32 mm/0.50 μm, He; Program: 0 0C (8 min) -> (1 min) -> 50 0C (2 min) 2.5 0C/min -> 100 0C 6 0C/min -> 250 0C

Van Den Dool and Kratz RI, polar column, temperature ramp

View large format table.

Column type Active phase I Reference Comment
CapillaryFFAP900.Steinhaus and Schieberle, 200730. m/0.32 mm/0.25 μm, 40. C @ 2. min, 6. K/min, 240. C @ 10. min
CapillaryCP-Wax 52CB924.Kourkoutas, Elmore, et al., 200660. m/0.25 mm/0.25 μm, He, 4. K/min; Tstart: 40. C; Tend: 250. C
CapillaryDB-Wax910.Varming, Andersen, et al., 200430. m/0.25 mm/0.25 μm, He, 40. C @ 10. min, 6. K/min, 240. C @ 25. min
CapillaryDB-Wax916.Varming, Petersen, et al., 200430. m/0.25 mm/0.25 μm, He, 40. C @ 10. min, 6. K/min, 240. C @ 25. min
CapillaryDB-Wax924.Shiratsuchi, Shimoda, et al., 199360. m/0.25 mm/0.25 μm, 50. C @ 4. min, 2. K/min, 230. C @ 30. min
CapillaryDB-Wax924.Shiratsuchi, Shimoda, et al., 199360. m/0.25 mm/0.25 μm, 50. C @ 4. min, 2. K/min, 230. C @ 30. min
PackedCarbowax 20M903.van den Dool and Kratz, 1963Celite 545, 4.6 K/min; Tstart: 75. C; Tend: 228. C

Van Den Dool and Kratz RI, polar column, custom temperature program

View large format table.

Column type Active phase I Reference Comment
CapillarySupelcowax-10930.Bianchi, Careri, et al., 200730. m/0.25 mm/0.25 μm, He; Program: 35C(8min) => 4C/min => 60C => 6C/min => 160C => 20C/min => 200C(1min)

Normal alkane RI, non-polar column, isothermal

View large format table.

Column type Active phase Temperature (C) I Reference Comment
CapillaryOV-101120.676.Blazso, Ujszaszi, et al., 1980Column length: 20. m; Column diameter: 0.23 mm
CapillaryOV-101160.667.Blazso, Ujszaszi, et al., 1980Column length: 20. m; Column diameter: 0.23 mm
PackedSE-3070.679.Yabumoto, Jennings, et al., 1977

Normal alkane RI, non-polar column, temperature ramp

View large format table.

Column type Active phase I Reference Comment
CapillaryDB-1673.Kumazawa, Itobe, et al., 200830. m/0.25 mm/0.25 μm, He, 5. K/min; Tstart: 30. C; Tend: 210. C
CapillaryHP-5691.6Leffingwell and Alford, 200560. m/0.32 mm/0.25 μm, He, 30. C @ 2. min, 2. K/min, 260. C @ 28. min
CapillaryRTX-5694.Tokitomo, Steihaus, et al., 200560. m/0.53 mm/1.5 μm, Helium, 6. K/min; Tstart: 0. C; Tend: 240. C
CapillaryHP-5681.Larsen and Frisvad, 199535. C @ 2. min, 6. K/min; Tend: 200. C
CapillaryOV-101673.Anker, Jurs, et al., 19902. K/min; Column length: 50. m; Column diameter: 0.28 mm; Tstart: 80. C; Tend: 200. C
CapillarySE-30670.Dirinck, de Pooter, et al., 1981N2, 2. K/min; Column length: 200. m; Column diameter: 0.6 mm; Tstart: 20. C; Tend: 220. C

Normal alkane RI, non-polar column, custom temperature program

View large format table.

Column type Active phase I Reference Comment
CapillaryHP-5681.Rotsatschakul, Visesanguan, et al., 200960. m/0.25 mm/0.25 μm, Helium; Program: 30 0C (2 min) 2 0Cmin -> 60 0C 10 0C/min -> 100 0C 20 0C/min -> 140 0C 10 0C/min -> 200 0C (10 min)
CapillaryDB-5690.Beaulieu and Lancaster, 200730. m/0.25 mm/0.25 μm; Program: 50C(1min) => 5C/min => 100C => 10C/min => 250C (9min)
CapillarySE-30665.Liu, Liang, et al., 2007Program: not specified
CapillaryDB-5684.Tokitomo, Steihaus, et al., 200530. m/0.32 mm/0.25 μm, Helium; Program: 40 0C (2 min) 40 0C/min -> 60 0C (2 min) 6 0C/min -> 180 0C 10 0C/min -> 240 0C (5 min)
CapillarySE-30673.Vinogradov, 2004Program: not specified
CapillaryHP-5685.Jordán, Margaría, et al., 200230. m/0.25 mm/0.25 μm; Program: 40C (6min) => 2.5C/min => 150C => 90C/min => 250C
CapillaryCP Sil 8 CB684.Duckham, Dodson, et al., 200160. m/0.25 mm/0.25 μm; Program: not specified
CapillaryMethyl Silicone671.Estrada and Gutierrez, 1999Program: not specified

Normal alkane RI, polar column, isothermal

View large format table.

Column type Active phase Temperature (C) I Reference Comment
PackedCarbowax 20M100.919.Yabumoto, Jennings, et al., 1977

Normal alkane RI, polar column, temperature ramp

View large format table.

Column type Active phase I Reference Comment
CapillaryDB-Wax927.Kumazawa, Itobe, et al., 200830. m/0.25 mm/0.25 μm, He, 5. K/min; Tstart: 30. C; Tend: 210. C
CapillaryDB-Wax921.Tanaka, Yamauchi, et al., 200330. m/0.25 mm/0.25 μm, 30. C @ 1. min, 4. K/min; Tend: 250. C
CapillaryDB-Wax922.Tanaka, Yamauchi, et al., 200330. m/0.25 mm/0.25 μm, 30. C @ 1. min, 4. K/min; Tend: 250. C
CapillaryDB-Wax919.Hayata, Sakamoto, et al., 200260. m/0.25 mm/0.25 μm, He, 40. C @ 10. min, 3. K/min, 220. C @ 10. min
CapillaryDB-Wax924.Shimoda, Shiratsuchi, et al., 199360. m/0.25 mm/0.25 μm, He, 50. C @ 4. min, 2. K/min; Tend: 230. C
CapillaryDB-Wax924.Shimoda, Shiratsuchi, et al., 199360. m/0.25 mm/0.25 μm, He, 50. C @ 4. min, 2. K/min; Tend: 230. C
CapillaryCarbowax 20M913.Anker, Jurs, et al., 19902. K/min; Column length: 80. m; Column diameter: 0.2 mm; Tstart: 70. C; Tend: 170. C
CapillaryDB-Wax920.Takeoka and Butter, 198960. m/0.32 mm/0.25 μm, He, 30. C @ 4. min, 2. K/min; Tend: 180. C
CapillaryDB-Wax922.Takeoka and Butter, 198960. m/0.32 mm/0.25 μm, He, 30. C @ 4. min, 2. K/min; Tend: 180. C

Normal alkane RI, polar column, custom temperature program

View large format table.

Column type Active phase I Reference Comment
CapillaryCP-Wax 58CB940.Tokitomo, Steihaus, et al., 200525. m/0.32 mm/0.20 μm, Helium; Program: 40 0C (2 min) 40 0C/min -> 60 0C (1 min) 6 0C/min -> 180 0C 10 0C/min -> 240 0C (5 min)
CapillaryCarbowax 20M913.Vinogradov, 2004Program: not specified
CapillaryCarbowax 400, Carbowax 20M, Carbowax 1540, Carbowax 4000, Superox 06, PEG 20M, etc.903.Waggott and Davies, 1984Hydrogen; Column length: 50. m; Column diameter: 0.32 mm; Program: not specified

References

Dolliver, Gresham, et al., 1938
Dolliver, M.A.; Gresham, T.L.; Kistiakowsky, G.B.; Smith, E.A.; Vaughan, W.E.,
Heats of Organic Reactions VI. Heats of Hydrogenation of Some Oxygen- Containing Compounds,
J. Am. Chem. Soc., 1938, 60, 440. [all data]
Timmermans, 1922
Timmermans, J.,
Investigation of the Freezing Point of Organic Substances VII,
Bull. Soc. Chim. Belg., 1922, 31, 389. [all data]
Young, 1910
Young, S.,
The Internal Heat of Vaporization constants of thirty pure substances,
Sci. Proc. R. Dublin Soc., 1910, 12, 374. [all data]
Young and Thomas, 1893
Young, S.; Thomas, G.L.,
The vapour pressures, molecular volumes, and critical constants of ten of the lower esters,
J. Chem. Soc., 1893, 63, 1191. [all data]
Pawlewski, 1882
Pawlewski, B.,
The critical temperatures of ester compounds,
Ber. Dtsch. Chem. Ges., 1882, 15, 2460-4. [all data]
Majer and Svoboda, 1985
Majer, V.; Svoboda, V.,
Enthalpies of Vaporization of Organic Compounds: A Critical Review and Data Compilation, Blackwell Scientific Publications, Oxford, 1985, 300. [all data]
Mathews, 1926
Mathews, J.H.,
The accurate measurement of heats of vaporization of liquids,
J. Am. Chem. Soc., 1926, 48, 562-576. [all data]
Stephenson and Malanowski, 1987
Stephenson, Richard M.; Malanowski, Stanislaw,
Handbook of the Thermodynamics of Organic Compounds, 1987, https://doi.org/10.1007/978-94-009-3173-2
. [all data]
Stull, 1947
Stull, Daniel R.,
Vapor Pressure of Pure Substances. Organic and Inorganic Compounds,
Ind. Eng. Chem., 1947, 39, 4, 517-540, https://doi.org/10.1021/ie50448a022
. [all data]
Wiberg, Martin, et al., 1985
Wiberg, K.B.; Martin, E.J.; Squires, R.R.,
Thermochemical studies of carbonyl compounds. 3. Enthalpies of hydrolysis of ortho esters,
J. Org. Chem., 1985, 50, 4717-4720. [all data]
Guthrie and Cullimore, 1980
Guthrie, J.P.; Cullimore, P.A.,
Effect of the acyl substituent on the equilibrium constant for hydration of esters,
Can. J. Chem., 1980, 58, 1281-1294. [all data]
Vilcu and Perisanu, 1980
Vilcu, R.; Perisanu, S.,
The ideal gas state enthalpies of formation of some monomers,
Rev. Roum. Chim., 1980, 25, 619-624. [all data]
Dolliver, Gresham, et al., 1938, 2
Dolliver, M.A.; Gresham, T.L.; Kistiakowsky, G.B.; Smith, E.A.; Vaughan, W.E.,
Heats of organic reactions. VI. Heats of hydrogenation of some oxygen-containing compounds,
J. Am. Chem. Soc., 1938, 60, 440-450. [all data]
Wiberg, 1980
Wiberg, K.B.,
Energies of organic compounds,
Rept. DOE-E(11-1)4060 Prepared for US Dept. of Energy by Yale Univ., New Haven, CT. Avail. NTIS, 1980, 1-24. [all data]
Hunter and Lias, 1998
Hunter, E.P.; Lias, S.G.,
Evaluated Gas Phase Basicities and Proton Affinities of Molecules: An Update,
J. Phys. Chem. Ref. Data, 1998, 27, 3, 413-656, https://doi.org/10.1063/1.556018
. [all data]
Burgers, Holmes, et al., 1983
Burgers, P.C.; Holmes, J.L.; Lossing, F.P.; Povel, F.R.; Terlouw, J.K.,
The role of charge-site location in fragmenting ions. 1- [CH3CHXCOOCH3]+ and [CH2XCH2COOCH3]+ ions and the structures of daughter ions derived from the loss of X (X = I, Br, Cl and CH3),
Org. Mass Spectrom., 1983, 18, 335. [all data]
Watanabe, Nakayama, et al., 1962
Watanabe, K.; Nakayama, T.; Mottl, J.,
Ionization potentials of some molecules,
J. Quant. Spectry. Radiative Transfer, 1962, 2, 369. [all data]
Holmes, Lossing, et al., 1991
Holmes, J.L.; Lossing, F.P.; Mayer, P.M.,
Heats of formation of oxygen-containing organic free radicals from appearance energy measurements,
J. Am. Chem. Soc., 1991, 113, 9723. [all data]