2-Cyclopropene-1-carboxylic acid, 2-methyl-3-phenyl-, methyl ester
- Formula: C12H12O2
- Molecular weight: 188.2225
- IUPAC Standard InChIKey: PMIJDCMZUFOEOE-UHFFFAOYSA-N
- CAS Registry Number: 54564-58-8
- Chemical structure:
View 3d structure (requires JavaScript / HTML 5) - Permanent link for this species. Use this link for bookmarking this species for future reference.

Gas phase ion energetics data

Data compiled by: Sharon G. Lias, John E. Bartmess, Joel F. Liebman, John L. Holmes, Rhoda D. Levin, and W. Gary Mallard
Ionization energy determinations
IE (eV) | Method | Reference | Comment |
---|---|---|---|
8.28 | PE | Baidin, Domnin, et al., 1984 | Vertical value |

References

Baidin, Domnin, et al., 1984
Baidin, V.N.; Domnin, I.N.; Prokhorenko, O.A.; Elbel, S.; de Meijere, A.,
Photoelectron spectra of phenyl substituted cyclopropene derivatives,
J. Electron Spectrosc. Relat. Phenom., 1984, 34, 103. [all data]