1,1'-Biphenyl, 2-butyl-
- Formula: C16H18
- Molecular weight: 210.3141
- IUPAC Standard InChIKey: RMSGQZDGSZOJMU-UHFFFAOYSA-N
- CAS Registry Number: 54532-97-7
- Chemical structure:
View 3d structure (requires JavaScript / HTML 5) - Species with the same structure:

Condensed phase thermochemistry data

Data compiled by: Hussein Y. Afeefy, Joel F. Liebman, and Stephen E. Stein
Quantity | Value | Units | Method | Reference | Comment |
---|---|---|---|---|---|
ΔcH°liquid | -8494. | kJ/mol | Ccb | Goodman and Wise, 1950 | Corresponding ΔfHºliquid = -380. kJ/mol (simple calculation by NIST; no Washburn corrections) |

Phase change data

Data compiled by: Thermodynamics Research Center, NIST Boulder Laboratories, Chris Muzny director
Quantity | Value | Units | Method | Reference | Comment |
---|---|---|---|---|---|
Tboil | 554.35 | K | N/A | Goodman and Wise, 1951 | Uncertainty assigned by TRC = 0.5 K |
Tboil | 564.35 | K | N/A | Goodman and Wise, 1950, 2 | Uncertainty assigned by TRC = 0.2 K |
Quantity | Value | Units | Method | Reference | Comment |
Tfus | 263.50 | K | N/A | Goodman and Wise, 1951 | Crystal phase 1 phase; Uncertainty assigned by TRC = 0.5 K |
Tfus | 259.44 | K | N/A | Goodman and Wise, 1951 | Crystal phase 2 phase; Uncertainty assigned by TRC = 0.5 K |
Tfus | 258.44 | K | N/A | Goodman and Wise, 1950, 2 | Metastable crystal phase; Uncertainty assigned by TRC = 0.2 K |
Tfus | 263.5 | K | N/A | Goodman and Wise, 1950, 2 | Uncertainty assigned by TRC = 0.15 K |

Gas phase ion energetics data

Data compiled by: Sharon G. Lias, Rhoda D. Levin, and Sherif A. Kafafi
Ionization energy determinations
IE (eV) | Method | Reference | Comment |
---|---|---|---|
8.50 ± 0.02 | PE | Maier and Turner, 1972 | Vertical value |

References

Goodman and Wise, 1950
Goodman, I.A.; Wise, P.H.,
Dicyclic hydrocarbons. I. 2-Aklylbiphenyls,
J. Am. Chem. Soc., 1950, 72, 3076-3078. [all data]
Goodman and Wise, 1951
Goodman, I.A.; Wise, P.H.,
Synthesis & purification of some alkylbiphenyls & alkylbicyclohexyls., Natl. Advis. Comm. Aeronaut., Tech. Note NACA TN 2260, Lewis Flight Propulsion Lab., Cleveland, Ohio, 1951. [all data]
Goodman and Wise, 1950, 2
Goodman, I.A.; Wise, P.H.,
Dicycloic Hydrocarbons I. 2-Alkylbiphenyls,
J. Am. Chem. Soc., 1950, 72, 3076. [all data]
Maier and Turner, 1972
Maier, J.P.; Turner, D.W.,
Steric inhibition of resonance studied by molecular photoelectron spectroscopy. Part I. Biphenyls,
Faraday Discuss. Chem. Soc., 1972, 54, 149. [all data]
Kusakov, et al., 1963
Kusakov, M.M., et al.,
Ultraviolet Absorption Spectra of Aromatic Hydrocarbons, 1963, 186. [all data]