HCBr2+

Vibrational and/or electronic energy levels

Data compiled by: Marilyn E. Jacox

State:   X

Vib.
sym.
 No.   Approximate
 type of mode
 cm-1   Med.   Method   References

b2 5 H deformation 1229 m Ar IR Andrews, Wight, et al., 1978
Andrews, Prochaska, et al., 1979
6 CBr stretch 897 vs Ar IR Andrews, Wight, et al., 1978
Andrews, Prochaska, et al., 1979
Kelsall and Andrews, 1983

Additional references: Jacox, 1994, page 172

References

Andrews, Wight, et al., 1978
Andrews, L.; Wight, C.A.; Prochaska, F.T.; McDonald, S.A.; Ault, B.S., Vacuum-ultraviolet photoionization of bromoform and its chlorine substituted counterparts during condensation with argon at 15 K, J. Mol. Spectrosc., 1978, 73, 1, 120, https://doi.org/10.1016/0022-2852(78)90199-6 . [all data]

Andrews, Prochaska, et al., 1979
Andrews, L.; Prochaska, F.T.; Ault, B.S., Matrix photoionization and radiolysis of dichloromethane and dibromomethane. Infrared and ultraviolet absorption spectra and photolysis of CH2Cl2+ and CH2Br2+, J. Am. Chem. Soc., 1979, 101, 1, 9, https://doi.org/10.1021/ja00495a002 . [all data]

Kelsall and Andrews, 1983
Kelsall, B.J.; Andrews, L., FTIR spectroscopic studies of the matrix photoionization and photolysis products of methylene halides, J. Mol. Spectrosc., 1983, 97, 2, 362, https://doi.org/10.1016/0022-2852(83)90274-6 . [all data]

Jacox, 1994
Jacox, M.E., Vibrational and electronic energy levels of polyatomic transient molecules, American Chemical Society, Washington, DC, 1994, 464. [all data]