Acetonitrile, trichloro-
- Formula: C2Cl3N
- Molecular weight: 144.387
- IUPAC Standard InChIKey: DRUIESSIVFYOMK-UHFFFAOYSA-N
- CAS Registry Number: 545-06-2
- Chemical structure:
View 3d structure (requires JavaScript / HTML 5) - Other names: Cyanotrichloromethane; Trichloroacetonitrile; Trichloromethyl cyanide; Tritox; CCl3CN; Nitrile trichloracetique; Trichlor-acetonitril; Trichloroethanenitrile; Trichlouracetonitril; Trichlormethylkyanid; Trichloromethylnitrile; Acetonitrile, 2,2,2-trichloro-; NSC 66405

Phase change data

Data compiled as indicated in comments:
TRC - Thermodynamics Research Center, NIST Boulder Laboratories, Chris Muzny director
BS - Robert L. Brown and Stephen E. Stein
AC - William E. Acree, Jr., James S. Chickos
Quantity | Value | Units | Method | Reference | Comment |
---|---|---|---|---|---|
Tboil | 357. | K | N/A | Stephenson, 1994 | Uncertainty assigned by TRC = 2. K; TRC |
Tboil | 356.7 | K | N/A | Aldrich Chemical Company Inc., 1990 | BS |
Enthalpy of vaporization
ΔvapH (kJ/mol) | Temperature (K) | Method | Reference | Comment |
---|---|---|---|---|
35.1 | 304. | A | Stephenson and Malanowski, 1987 | Based on data from 289. to 357. K. See also Dykyj, 1970.; AC |
34.7 | 304. | N/A | Davies and Jenkin, 1954 | Based on data from 289. to 356. K.; AC |
Antoine Equation Parameters
log10(P) = A − (B / (T + C))
P = vapor pressure (bar)
T = temperature (K)
View plot Requires a JavaScript / HTML 5 canvas capable browser.
Temperature (K) | A | B | C | Reference | Comment |
---|---|---|---|---|---|
289.9 to 356.6 | 3.3205 | 863.988 | -98.404 | Davies and Jenkin, 1954, 2 | Coefficents calculated by NIST from author's data. |

Gas phase ion energetics data

Data evaluated as indicated in comments:
HL - Edward P. Hunter and Sharon G. Lias
Data compiled as indicated in comments:
LBLHLM - Sharon G. Lias, John E. Bartmess, Joel F. Liebman, John L. Holmes, Rhoda D. Levin, and W. Gary Mallard
RDSH - Henry M. Rosenstock, Keith Draxl, Bruce W. Steiner, and John T. Herron
B - John E. Bartmess
Quantity | Value | Units | Method | Reference | Comment |
---|---|---|---|---|---|
Proton affinity (review) | 723.2 | kJ/mol | N/A | Hunter and Lias, 1998 | HL |
Quantity | Value | Units | Method | Reference | Comment |
Gas basicity | 692.6 | kJ/mol | N/A | Hunter and Lias, 1998 | HL |
Electron affinity determinations
EA (eV) | Method | Reference | Comment |
---|---|---|---|
>0.30 ± 0.20 | NBIE | Brooks, Harland, et al., 2007 | B |
Ionization energy determinations
IE (eV) | Method | Reference | Comment |
---|---|---|---|
11.89 | PE | Molder, Pikver, et al., 1983 | LBLHLM |
11.96 | PE | Lake and Thompson, 1970 | Vertical value; RDSH |

Kovats' RI, non-polar column, isothermal

Column type | Active phase | Temperature (C) | I | Reference | Comment |
---|---|---|---|---|---|
Packed | Apiezon L | 100. | 662. | Brown, Chapman, et al., 1968 | N2, DCMS-treated Chromosorb W; Column length: 2.3 m |

Normal alkane RI, non-polar column, custom temperature program

Column type | Active phase | I | Reference | Comment |
---|---|---|---|---|
Capillary | OV-1, SE-30, Methyl silicone, SP-2100, OV-101, DB-1, etc. | 668. | Waggott and Davies, 1984 | Hydrogen; Column length: 50. m; Column diameter: 0.32 mm; Program: not specified |

References

Stephenson, 1994
Stephenson, R.M.,
Mutual Solubility of Water and Nitriles,
J. Chem. Eng. Data, 1994, 39, 225-7. [all data]
Aldrich Chemical Company Inc., 1990
Aldrich Chemical Company Inc.,
Catalog Handbook of Fine Chemicals, Aldrich Chemical Company, Inc., Milwaukee WI, 1990, 1. [all data]
Stephenson and Malanowski, 1987
Stephenson, Richard M.; Malanowski, Stanislaw,
Handbook of the Thermodynamics of Organic Compounds, 1987, https://doi.org/10.1007/978-94-009-3173-2
. [all data]
Dykyj, 1970
Dykyj, J.,
Petrochemica, 1970, 10, 2, 51. [all data]
Davies and Jenkin, 1954
Davies, Mansel; Jenkin, David G.,
Physical properties and thermodynamic functions of trichloroacetonitrile,
J. Chem. Soc., 1954, 2374, https://doi.org/10.1039/jr9540002374
. [all data]
Davies and Jenkin, 1954, 2
Davies, M.; Jenkin, D.G.,
Physical Properties and Thermodynamic Functions of Trichloroacetonitrile,
J. Chem. Soc., 1954, 2374-2377, https://doi.org/10.1039/jr9540002374
. [all data]
Hunter and Lias, 1998
Hunter, E.P.; Lias, S.G.,
Evaluated Gas Phase Basicities and Proton Affinities of Molecules: An Update,
J. Phys. Chem. Ref. Data, 1998, 27, 3, 413-656, https://doi.org/10.1063/1.556018
. [all data]
Brooks, Harland, et al., 2007
Brooks, P.R.; Harland, P.W.; Harris, S.A.; Kennair, T.; Redden, C.; Tate, J.F.,
Steric effects in electron transfer from potassium to pi-bonded oriented molecules CH3CN, CH3NC, and CCl3CN,
J. Am. Chem. Soc., 2007, 129, 50, 15572-15580, https://doi.org/10.1021/ja074302d
. [all data]
Molder, Pikver, et al., 1983
Molder, U.H.; Pikver, R.J.; Koppel, I.A.,
Photoelectron spectra of molecules. 3. Nitriles,
Org. React. Tartu, 1983, 20, 230. [all data]
Lake and Thompson, 1970
Lake, R.F.; Thompson, H.,
The photoelectron spectra of some molecules containing the C N group,
Proc. Roy. Soc. (London), 1970, A317, 187. [all data]