[1,2,3]Thiadiazolo[5,4-b]pyridine,5-chloro-
- Formula: C5H2ClN3S
- Molecular weight: 171.607
- IUPAC Standard InChIKey: BIVJJLMQFZZGOM-UHFFFAOYSA-N
- CAS Registry Number: 54459-89-1
- Chemical structure:
View 3d structure (requires JavaScript / HTML 5) - Permanent link for this species. Use this link for bookmarking this species for future reference.

Gas phase ion energetics data

Data compiled by: Sharon G. Lias, Rhoda D. Levin, and Sherif A. Kafafi
Ionization energy determinations
IE (eV) | Method | Reference |
---|---|---|
9.57 ± 0.05 | EI | Thorstad and Undheim, 1974 |

References

Thorstad and Undheim, 1974
Thorstad, O.; Undheim, K.,
Mass spectrometry of onium compounds. XXIV. Ionisation potential in structure analysis of pyridodiazo-oxides,
Chem. Scr., 1974, 6, 222. [all data]