4(3H)-Pyridinone,3-diazo-
- Formula: C5H3N3O
- Molecular weight: 121.0968
- IUPAC Standard InChIKey: LOFCPEZTSSFRTH-UHFFFAOYSA-N
- CAS Registry Number: 54459-88-0
- Chemical structure:
View 3d structure (requires JavaScript / HTML 5) - Permanent link for this species. Use this link for bookmarking this species for future reference.

Gas phase ion energetics data

Data compiled by: Sharon G. Lias, Rhoda D. Levin, and Sherif A. Kafafi
Ionization energy determinations
IE (eV) | Method | Reference |
---|---|---|
9.00 ± 0.05 | EI | Thorstad and Undheim, 1974 |

References

Thorstad and Undheim, 1974
Thorstad, O.; Undheim, K.,
Mass spectrometry of onium compounds. XXIV. Ionisation potential in structure analysis of pyridodiazo-oxides,
Chem. Scr., 1974, 6, 222. [all data]