1,3,5-Cycloheptatriene
- Formula: C7H8
- Molecular weight: 92.1384
- IUPAC Standard InChIKey: CHVJITGCYZJHLR-UHFFFAOYSA-N
- CAS Registry Number: 544-25-2
- Chemical structure:
View 3d structure (requires JavaScript / HTML 5) - Other names: Tropilidene; Cyclohepta-1,3,5-triene; Cycloheptatriene; Tropilidin; UN 2603

Gas phase thermochemistry data

Data compiled as indicated in comments:
ALS - Hussein Y. Afeefy, Joel F. Liebman, and Stephen E. Stein
GT - Glushko Thermocenter, Russian Academy of Sciences, Moscow
Quantity | Value | Units | Method | Reference | Comment |
---|---|---|---|---|---|
ΔfH°gas | 187. | kJ/mol | Chyd | Roth, Bohm, et al., 1983 | ALS |
Quantity | Value | Units | Method | Reference | Comment |
S°gas | 315.6 ± 1.1 | J/mol*K | N/A | Finke H.L., 1956 | GT |
Constant pressure heat capacity of gas
Cp,gas (J/mol*K) | Temperature (K) | Reference | Comment |
---|---|---|---|
33.95 | 50. | Dorofeeva O.V., 1986 | Recommended S(298.15 K) value agrees with experimental value within its uncertainty. Value of S(298.15 K) calculated by [ Evans M.V., 1960] is 2.4 J/mol*K larger than experimental one.; GT |
42.24 | 100. | ||
55.52 | 150. | ||
71.04 | 200. | ||
96.97 | 273.15 | ||
106.3 ± 3.5 | 298.15 | ||
106.94 | 300. | ||
142.80 | 400. | ||
173.73 | 500. | ||
199.18 | 600. | ||
220.09 | 700. | ||
237.49 | 800. | ||
252.14 | 900. | ||
264.56 | 1000. | ||
275.16 | 1100. | ||
284.24 | 1200. | ||
292.05 | 1300. | ||
298.79 | 1400. | ||
304.63 | 1500. |

Condensed phase thermochemistry data

Data compiled as indicated in comments:
ALS - Hussein Y. Afeefy, Joel F. Liebman, and Stephen E. Stein
DH - Eugene S. Domalski and Elizabeth D. Hearing
Quantity | Value | Units | Method | Reference | Comment |
---|---|---|---|---|---|
ΔcH°liquid | -4040. ± 2. | kJ/mol | Ccb | Jackson, Hung, et al., 1971 | Corresponding ΔfHºliquid = 142. kJ/mol (simple calculation by NIST; no Washburn corrections); ALS |
Quantity | Value | Units | Method | Reference | Comment |
S°liquid | 214.64 | J/mol*K | N/A | Finke, Scott, et al., 1956 | DH |
Constant pressure heat capacity of liquid
Cp,liquid (J/mol*K) | Temperature (K) | Reference | Comment |
---|---|---|---|
162.76 | 298.15 | Finke, Scott, et al., 1956 | T = 10 to 320 K.; DH |

Phase change data

Data compiled as indicated in comments:
BS - Robert L. Brown and Stephen E. Stein
TRC - Thermodynamics Research Center, NIST Boulder Laboratories, Chris Muzny director
ALS - Hussein Y. Afeefy, Joel F. Liebman, and Stephen E. Stein
AC - William E. Acree, Jr., James S. Chickos
CAL - James S. Chickos, William E. Acree, Jr., Joel F. Liebman, Students of Chem 202 (Introduction to the Literature of Chemistry), University of Missouri -- St. Louis
DH - Eugene S. Domalski and Elizabeth D. Hearing
Quantity | Value | Units | Method | Reference | Comment |
---|---|---|---|---|---|
Tboil | 389.7 | K | N/A | Aldrich Chemical Company Inc., 1990 | BS |
Quantity | Value | Units | Method | Reference | Comment |
Ttriple | 197.92 | K | N/A | McCullough and Waddington, 1957 | Uncertainty assigned by TRC = 0.07 K; IPTS-48; TRC |
Ttriple | 197.91 | K | N/A | Finke, Scott, et al., 1956, 2 | Crystal phase 1 phase; Uncertainty assigned by TRC = 0.07 K; TRC |
Ttriple | 197.92 | K | N/A | Finke, Scott, et al., 1956, 2 | Crystal phase 1 phase; Uncertainty assigned by TRC = 0.05 K; TRC |
Quantity | Value | Units | Method | Reference | Comment |
ΔvapH° | 38.70 ± 0.21 | kJ/mol | V | Finke, Scott, et al., 1956, 3 | ALS |
ΔvapH° | 38.7 ± 0.2 | kJ/mol | N/A | Finke, Scott, et al., 1956 | AC |
Reduced pressure boiling point
Tboil (K) | Pressure (bar) | Reference | Comment |
---|---|---|---|
390.2 | 0.999 | Weast and Grasselli, 1989 | BS |
333.7 | 0.163 | Weast and Grasselli, 1989 | BS |
Enthalpy of vaporization
ΔvapH (kJ/mol) | Temperature (K) | Method | Reference | Comment |
---|---|---|---|---|
40.8 | 288. | A | Stephenson and Malanowski, 1987 | Based on data from 273. to 338. K. See also Kkykj and Repas, 1973.; AC |
39.4 | 288. | A,EB | Stephenson and Malanowski, 1987 | Based on data from 273. to 416. K. See also Finke, Scott, et al., 1956.; AC |
Antoine Equation Parameters
log10(P) = A − (B / (T + C))
P = vapor pressure (bar)
T = temperature (K)
View plot Requires a JavaScript / HTML 5 canvas capable browser.
Temperature (K) | A | B | C | Reference | Comment |
---|---|---|---|---|---|
273. to 338. | 4.18511 | 1422.104 | -48.151 | Finke, Scott, et al., 1956 | Coefficents calculated by NIST from author's data. |
Enthalpy of fusion
ΔfusH (kJ/mol) | Temperature (K) | Reference | Comment |
---|---|---|---|
1.16 | 198. | Domalski and Hearing, 1996 | AC |
Entropy of fusion
ΔfusS (J/mol*K) | Temperature (K) | Reference | Comment |
---|---|---|---|
15.24 | 154.0 | Domalski and Hearing, 1996 | CAL |
5.86 | 198.0 |
Enthalpy of phase transition
ΔHtrs (kJ/mol) | Temperature (K) | Initial Phase | Final Phase | Reference | Comment |
---|---|---|---|---|---|
2.3468 | 153.98 | crystaline, II | crystaline, I | Finke, Scott, et al., 1956 | DH |
1.1606 | 197.92 | crystaline, I | liquid | Finke, Scott, et al., 1956 | DH |
Entropy of phase transition
ΔStrs (J/mol*K) | Temperature (K) | Initial Phase | Final Phase | Reference | Comment |
---|---|---|---|---|---|
15.24 | 153.98 | crystaline, II | crystaline, I | Finke, Scott, et al., 1956 | DH |
5.86 | 197.92 | crystaline, I | liquid | Finke, Scott, et al., 1956 | DH |

Reaction thermochemistry data

Data compiled as indicated in comments:
ALS - Hussein Y. Afeefy, Joel F. Liebman, and Stephen E. Stein
B - John E. Bartmess
Individual Reactions
By formula: 3H2 + C7H8 = C7H14
Quantity | Value | Units | Method | Reference | Comment |
---|---|---|---|---|---|
ΔrH° | -305. ± 0.4 | kJ/mol | Chyd | Roth, Klaerner, et al., 1983 | liquid phase; solvent: Isooctane; ALS |
ΔrH° | -294.9 ± 1.6 | kJ/mol | Chyd | Turner, Meador, et al., 1957 | liquid phase; solvent: Acetic acid; ALS |
ΔrH° | -301.7 ± 1.3 | kJ/mol | Chyd | Conn, Kistiakowsky, et al., 1939 | gas phase; Reanalyzed by Cox and Pilcher, 1970, Original value = -304.8 ± 0.04 kJ/mol; at 355 K; ALS |
C7H7- + =
Quantity | Value | Units | Method | Reference | Comment |
---|---|---|---|---|---|
ΔrH° | 1570. ± 9.2 | kJ/mol | G+TS | Bartmess, Scott, et al., 1979 | gas phase; value altered from reference due to change in acidity scale; B |
Quantity | Value | Units | Method | Reference | Comment |
ΔrG° | 1545. ± 8.4 | kJ/mol | IMRE | Bartmess, Scott, et al., 1979 | gas phase; value altered from reference due to change in acidity scale; B |
By formula: C7H8 = C7H8
Quantity | Value | Units | Method | Reference | Comment |
---|---|---|---|---|---|
ΔrH° | 0.669 | kJ/mol | Eqk | Gorlitz and Gunther, 1969 | liquid phase; NMR; ALS |

Gas phase ion energetics data

Data compiled as indicated in comments:
B - John E. Bartmess
LLK - Sharon G. Lias, Rhoda D. Levin, and Sherif A. Kafafi
RDSH - Henry M. Rosenstock, Keith Draxl, Bruce W. Steiner, and John T. Herron
Ionization energy determinations
IE (eV) | Method | Reference | Comment |
---|---|---|---|
8.29 | PI | Traeger and McLoughlin, 1978 | LLK |
8.03 | PE | Traeger and McLoughlin, 1978 | LLK |
8.52 | EI | Hoffman, 1974 | LLK |
8.40 | PE | Bodor, Dewar, et al., 1970 | RDSH |
8.20 ± 0.05 | PI | Akopyan and Vilesov, 1966 | RDSH |
8.28 | S | Price, Passmore, et al., 1963 | RDSH |
8.50 | PE | Muller, Schweig, et al., 1974 | Vertical value; LLK |
Appearance energy determinations
Ion | AE (eV) | Other Products | Method | Reference | Comment |
---|---|---|---|---|---|
C5H5+ | 16.66 | ? | EI | Harrison, Haynes, et al., 1965 | RDSH |
C5H5+ | 16.0 | ? | EI | Lifshitz and Bauer, 1963 | RDSH |
C6H5+ | 14.17 | CH3 | EI | Hoffman, 1974 | LLK |
C7H7+ | 9.36 | H | PI | Traeger and McLoughlin, 1978 | LLK |
C7H7+ | 9.36 ± 0.02 | H | TE | Traeger and McLoughlin, 1977 | LLK |
C7H7+ | 10.73 | H | EI | Hoffman, 1974 | LLK |
C7H7+ | ≤10.0 | H | PI | Akopyan and Vilesov, 1966 | RDSH |
C7H7+ | 10.1 ± 0.2 | H | EI | Harrison, Honnen, et al., 1960 | RDSH |
De-protonation reactions
C7H7- + =
Quantity | Value | Units | Method | Reference | Comment |
---|---|---|---|---|---|
ΔrH° | 1570. ± 9.2 | kJ/mol | G+TS | Bartmess, Scott, et al., 1979 | gas phase; value altered from reference due to change in acidity scale; B |
Quantity | Value | Units | Method | Reference | Comment |
ΔrG° | 1545. ± 8.4 | kJ/mol | IMRE | Bartmess, Scott, et al., 1979 | gas phase; value altered from reference due to change in acidity scale; B |

Henry's Law data

Data compiled by: Rolf Sander
Henry's Law constant (water solution)
kH(T) = k°H exp(d(ln(kH))/d(1/T) ((1/T) - 1/(298.15 K)))
k°H = Henry's law constant for solubility in water at 298.15 K (mol/(kg*bar))
d(ln(kH))/d(1/T) = Temperature dependence constant (K)
k°H (mol/(kg*bar)) | d(ln(kH))/d(1/T) (K) | Method | Reference | Comment |
---|---|---|---|---|
0.21 | Q | N/A | missing citation give several references for the Henry's law constants but don't assign them to specific species. |

Kovats' RI, non-polar column, isothermal

Column type | Active phase | Temperature (C) | I | Reference | Comment |
---|---|---|---|---|---|
Capillary | OV-1 | 150. | 807. | Zhang, Chen, et al., 1997 | 25. m/0.2 mm/0.33 μm, N2 |
Capillary | OV-1 | 150. | 794. | Zhang, Chen, et al., 1997 | 25. m/0.2 mm/0.33 μm, N2 |
Capillary | SE-30 | 130. | 800. | Bredael, 1982 | Column length: 100. m; Column diameter: 0.5 mm |
Capillary | SE-30 | 80. | 784. | Bredael, 1982 | Column length: 100. m; Column diameter: 0.5 mm |
Capillary | Squalane | 50. | 782.6 | Bajus, Veselý, et al., 1979 | Column length: 100. m; Column diameter: 0.25 mm |
Capillary | Squalane | 70. | 786.6 | Bajus, Veselý, et al., 1979 | Column length: 100. m; Column diameter: 0.25 mm |
Packed | Squalane | 100. | 774. | Robinson and Odell, 1971 | N2, Embacel; Column length: 3.0 m |
Packed | Squalane | 27. | 756. | Hively and Hinton, 1968 | He, Chromosorb P; Column length: 15. m; Column diameter: 0.25 mm |
Packed | Squalane | 49. | 763. | Hively and Hinton, 1968 | He, Chromosorb P; Column length: 15. m; Column diameter: 0.25 mm |
Packed | Squalane | 67. | 769. | Hively and Hinton, 1968 | He, Chromosorb P; Column length: 15. m; Column diameter: 0.25 mm |
Packed | Squalane | 86. | 775. | Hively and Hinton, 1968 | He, Chromosorb P; Column length: 15. m; Column diameter: 0.25 mm |

Van Den Dool and Kratz RI, non-polar column, temperature ramp

Column type | Active phase | I | Reference | Comment |
---|---|---|---|---|
Capillary | Petrocol DH | 771. | White, Hackett, et al., 1992 | 100. m/0.25 mm/0.5 μm, He, 1. K/min; Tstart: 30. C; Tend: 220. C |
Packed | SE-30 | 785. | Buchman, Cao, et al., 1984 | He, Chromosorb AW, 40. C @ 10. min, 10. K/min, 210. C @ 30. min; Column length: 3.05 m |

Van Den Dool and Kratz RI, non-polar column, custom temperature program

Column type | Active phase | I | Reference | Comment |
---|---|---|---|---|
Packed | SE-30 | 785. | Peng, Ding, et al., 1988 | Supelcoport; Chromosorb; Column length: 3.05 m; Program: 40C(5min) => 10C/min => 200C or 250C (60min) |

Van Den Dool and Kratz RI, polar column, temperature ramp

Column type | Active phase | I | Reference | Comment |
---|---|---|---|---|
Packed | Carbowax 20M | 1089. | Buchman, Cao, et al., 1984 | He, Supelcoport, 40. C @ 10. min, 10. K/min, 210. C @ 30. min; Column length: 3.05 m |

Normal alkane RI, non-polar column, temperature ramp

Column type | Active phase | I | Reference | Comment |
---|---|---|---|---|
Capillary | Petrocol DH | 776. | Supelco, 2012 | 100. m/0.25 mm/0.50 μm, Helium, 20. C @ 15. min, 15. K/min, 220. C @ 30. min |
Capillary | OV-101 | 787. | Zenkevich, 2005 | 25. m/0.20 mm/0.10 μm, N2/He, 6. K/min; Tstart: 50. C; Tend: 250. C |
Capillary | OV-1 | 758. | Orav, Kailas, et al., 1999 | 2. K/min; Tstart: 50. C; Tend: 160. C |
Capillary | HP-5 | 765. | Larsen and Frisvad, 1995 | 35. C @ 2. min, 6. K/min; Tend: 200. C |

Normal alkane RI, non-polar column, custom temperature program

Column type | Active phase | I | Reference | Comment |
---|---|---|---|---|
Capillary | Squalane | 784. | Chen, 2008 | Program: not specified |
Capillary | OV-1, SE-30, Methyl silicone, SP-2100, OV-101, DB-1, etc. | 784. | Waggott and Davies, 1984 | Hydrogen; Column length: 50. m; Column diameter: 0.32 mm; Program: not specified |
Capillary | OV-1, SE-30, Methyl silicone, SP-2100, OV-101, DB-1, etc. | 785. | Waggott and Davies, 1984 | Hydrogen; Column length: 50. m; Column diameter: 0.32 mm; Program: not specified |
Packed | SE-30 | 800. | Robinson and Odell, 1971 | N2, Chromosorb W; Column length: 6.1 m; Program: 50C910min) => 20C/min => 90(6min) => 10C/min => 150C(hold) |
Packed | Squalane | 772. | Robinson and Odell, 1971 | N2, Embacel; Column length: 3.0 m; Program: 25C(5min) => 2C/min => 35 => 4C/min => 95C(hold) |
Packed | SE-30 | 800. | Robinson and Odell, 1971, 2 | Chrom W; Column length: 6.1 m; Program: 50C(10min) => 20C/min(2min) => 90C(6min) => 10C/min(6min) => (hold at 150C) |
Packed | Squalane | 772. | Robinson and Odell, 1971, 2 | Embacel; Column length: 3.0 m; Program: 25C(5min) => 2C/min(5min) => 4C/min(15min) => (hold at 95C) |

Normal alkane RI, polar column, custom temperature program

Column type | Active phase | I | Reference | Comment |
---|---|---|---|---|
Capillary | HP-Innowax FSC | 1056. | Tabanca, Kirimer, et al., 2001 | 60. m/0.25 mm/0.25 μm; Program: 60C(10min) => 4C/min => 220C(10min) => 1C/min => 240C |
Capillary | DB-Wax | 1089. | Peng, Yang, et al., 1991 | Program: not specified |
Capillary | Carbowax 400, Carbowax 20M, Carbowax 1540, Carbowax 4000, Superox 06, PEG 20M, etc. | 1089. | Waggott and Davies, 1984 | Hydrogen; Column length: 50. m; Column diameter: 0.32 mm; Program: not specified |

Lee's RI, non-polar column, temperature ramp

Column type | Active phase | I | Reference | Comment |
---|---|---|---|---|
Capillary | DB-5 | 108.9 | Donnelly, Abdel-Hamid, et al., 1993 | 30. m/0.32 mm/0.25 μm, He, 40. C @ 3. min, 8. K/min, 285. C @ 29.5 min |

References

Roth, Bohm, et al., 1983
Roth, W.R.; Bohm, M.; Lenhartz, H-W.; Vogel, E.,
Heats of hydrogenation. Part 5. Resonance energy of bridged [10]annulenes,
Angew. Chem., 1983, 95, 1011-1012. [all data]
Finke H.L., 1956
Finke H.L.,
Cycloheptane, cyclooctane, and 1,3,5-cycloheptatriene. Low-temperature thermal properties, vapor pressure, and derived chemical thermodynamic properties,
J. Am. Chem. Soc., 1956, 78, 5469-5476. [all data]
Dorofeeva O.V., 1986
Dorofeeva O.V.,
Thermodynamic properties of twenty-one monocyclic hydrocarbons,
J. Phys. Chem. Ref. Data, 1986, 15, 437-464. [all data]
Evans M.V., 1960
Evans M.V.,
Vibrational spectra and structure of the tropilidene molecule,
J. Am. Chem. Soc., 1960, 82, 1876-1882. [all data]
Jackson, Hung, et al., 1971
Jackson, W.; Hung, T.S.; Hopkins, H.P., Jr.,
Delocalization energies of troponoids from bomb calorimetric and vapour pressure measurements,
J. Chem. Thermodyn., 1971, 3, 347-353. [all data]
Finke, Scott, et al., 1956
Finke, H.L.; Scott, D.W.; Gross, M.E.; Messerly, J.F.; Waddington, G.,
Cycloheptane, cyclooctane and 1,3,5-cycloheptatriene. Low temperature thermal properties, vapor pressure and derived chemical thermodynamic properties,
J. Am. Chem. Soc., 1956, 78, 5469-5476. [all data]
Aldrich Chemical Company Inc., 1990
Aldrich Chemical Company Inc.,
Catalog Handbook of Fine Chemicals, Aldrich Chemical Company, Inc., Milwaukee WI, 1990, 1. [all data]
McCullough and Waddington, 1957
McCullough, J.P.; Waddington, G.,
Melting-point purity determinations: limitations as evidenced by calorimetric studies in the melting region,
Anal. Chim. Acta, 1957, 17, 80. [all data]
Finke, Scott, et al., 1956, 2
Finke, H.L.; Scott, D.W.; Gross, M.E.; Messerly, J.F.; Waddington, G.,
Cycloheptane, Cyclooctane and 1,3,5-Cycloheptatriene. Low Temperature Thermal Properties, Vapor Pressure and Derived Chemical Thermodynamic Prop.,
J. Am. Chem. Soc., 1956, 78, 5469. [all data]
Finke, Scott, et al., 1956, 3
Finke, H.L.; Scott, D.W.; Gross, M.E.; Messerly, J.F.; Waddington, G.,
Cycloheptane, cyclooctane and 1,3,5-cycloheptatriene. Low temperature thermal properties, vapor pressure and derived chemical thermodynamic properties,
J. Am. Chem. Soc., 1956, 78, 5469-54. [all data]
Weast and Grasselli, 1989
CRC Handbook of Data on Organic Compounds, 2nd Editon, Weast,R.C and Grasselli, J.G., ed(s)., CRC Press, Inc., Boca Raton, FL, 1989, 1. [all data]
Stephenson and Malanowski, 1987
Stephenson, Richard M.; Malanowski, Stanislaw,
Handbook of the Thermodynamics of Organic Compounds, 1987, https://doi.org/10.1007/978-94-009-3173-2
. [all data]
Kkykj and Repas, 1973
Kkykj, J.; Repas, M.,
Petrochemia, 1973, 13, 179. [all data]
Domalski and Hearing, 1996
Domalski, Eugene S.; Hearing, Elizabeth D.,
Heat Capacities and Entropies of Organic Compounds in the Condensed Phase. Volume III,
J. Phys. Chem. Ref. Data, 1996, 25, 1, 1, https://doi.org/10.1063/1.555985
. [all data]
Roth, Klaerner, et al., 1983
Roth, W.R.; Klaerner, F.G.; Gerit, F.; Grimme, W.; Koeser, H.G.; Busch, R.; Muskulus, B.; Breuckmann, R.; Scholz, B.P.; Lennartz, H.W.,
Stereochemistry of the bicyclo[2.1.0]pentane ring opening: thermolysis of tricyclo[3.2.0.0(,)]heptane derivatives,
Chem. Ber., 1983, 116, 2717-2737. [all data]
Turner, Meador, et al., 1957
Turner, R.B.; Meador, W.R.; Winkler, R.E.,
Heats of hydrogenation. I. Apparatus and the heats of hydrogenation of bicyclo[2,2,1]heptene, bicyclo[2,2,1]heptadiene, bicyclo[2,2,2]octene and bicyclo[2,2,2]octadiene,
J. Am. Chem. Soc., 1957, 79, 4116-4121. [all data]
Conn, Kistiakowsky, et al., 1939
Conn, J.B.; Kistiakowsky, G.B.; Smith, E.A.,
Heats of organic reactions. VIII. Some further hydrogenations, including those of some acetylenes,
J. Am. Chem. Soc., 1939, 61, 1868-1876. [all data]
Cox and Pilcher, 1970
Cox, J.D.; Pilcher, G.,
Thermochemistry of Organic and Organometallic Compounds, Academic Press, New York, 1970, 1-636. [all data]
Bartmess, Scott, et al., 1979
Bartmess, J.E.; Scott, J.A.; McIver, R.T., Jr.,
The gas phase acidity scale from methanol to phenol,
J. Am. Chem. Soc., 1979, 101, 6047. [all data]
Gorlitz and Gunther, 1969
Gorlitz, M.; Gunther, H.,
Protonenresonanz-spektroskopie ungesattigter ringsysteme-XIII,
Tetrahedron, 1969, 25, 4467-4480. [all data]
Traeger and McLoughlin, 1978
Traeger, J.C.; McLoughlin, R.G.,
A photoionization study of the energetics of C7H7+ ion formed from C7H8 precursors,
Int. J. Mass Spectrom. Ion Phys., 1978, 27, 319. [all data]
Hoffman, 1974
Hoffman, M.K.,
Hidden rearrangements in the mass spectral decomposition of cycloheptatriene,
Z. Naturforsch. A:, 1974, 29, 1077. [all data]
Bodor, Dewar, et al., 1970
Bodor, N.; Dewar, M.J.S.; Worley, S.D.,
Photoelectron spectra of molecules. III. Ionization potentials of some cyclic hydrocarbons and their derivatives, and heats of formation and ionization potentials calculated by the MINDO SCF MO method,
J. Am. Chem. Soc., 1970, 92, 19. [all data]
Akopyan and Vilesov, 1966
Akopyan, M.E.; Vilesov, F.I.,
A mass-spectrometric study of the photo-ionisation of benzene derivatives at wavelengths up to 885 A,
Zh. Fiz. Khim., 1966, 40, 125, In original 63. [all data]
Price, Passmore, et al., 1963
Price, W.C.; Passmore, T.R.; Roessler, D.M.,
[Title unavailable],
Faraday Discuss. Chem. Soc., 1963, 35, 238. [all data]
Muller, Schweig, et al., 1974
Muller, C.; Schweig, A.; Vermeer, H.,
Methode zur Berechnung induktiver und konjugativer Effekte - Andwendung auf Tropon,
Angew. Chem., 1974, 86, 275. [all data]
Harrison, Haynes, et al., 1965
Harrison, A.G.; Haynes, P.; McLean, S.; Meyer, F.,
The mass spectra of methyl-substituted cyclopentadienes,
J. Am. Chem. Soc., 1965, 87, 5099. [all data]
Lifshitz and Bauer, 1963
Lifshitz, C.; Bauer, S.H.,
Mass spectra of valence tautomers,
J. Phys. Chem., 1963, 67, 1629. [all data]
Traeger and McLoughlin, 1977
Traeger, J.C.; McLoughlin, R.G.,
Threshold photoionization and dissociation of toluene and cycloheptatriene,
J. Am. Chem. Soc., 1977, 99, 7351. [all data]
Harrison, Honnen, et al., 1960
Harrison, A.G.; Honnen, L.R.; Dauben, H.J., Jr.; Lossing, F.P.,
Free radicals by mass spectrometry. XX. Ionization potentials of cyclopentadienyl and cycloheptatrienyl radicals,
J. Am. Chem. Soc., 1960, 82, 5593. [all data]
Dauben and Dietsche, 1972
Dauben, W.G.; Dietsche, T.J.,
Stereospecific introduction of functionalized angular methyl groups via the claisen rearrangement. The octalin and hydrindenyl ring systems,
J. Org. Chem., 1972, 37, 8, 1212-1216. [all data]