n-Butyl nitrite
- Formula: C4H9NO2
- Molecular weight: 103.1198
- IUPAC Standard InChIKey: JQJPBYFTQAANLE-UHFFFAOYSA-N
- CAS Registry Number: 544-16-1
- Chemical structure:

Gas phase thermochemistry data

Data compiled by: Hussein Y. Afeefy, Joel F. Liebman, and Stephen E. Stein
Quantity | Value | Units | Method | Reference | Comment |
---|---|---|---|---|---|
ΔfH°gas | -146. ± 4.2 | kJ/mol | Ccb | Batt, Christie, et al., 1974 |

Condensed phase thermochemistry data

Data compiled by: Hussein Y. Afeefy, Joel F. Liebman, and Stephen E. Stein
Quantity | Value | Units | Method | Reference | Comment |
---|---|---|---|---|---|
ΔfH°liquid | -182. | kJ/mol | Ccb | Batt, Christie, et al., 1974 | |
Quantity | Value | Units | Method | Reference | Comment |
ΔcH°liquid | -2678. ± 0.8 | kJ/mol | Ccb | Batt, Christie, et al., 1974 |

Phase change data

Data compiled as indicated in comments:
BS - Robert L. Brown and Stephen E. Stein
ALS - Hussein Y. Afeefy, Joel F. Liebman, and Stephen E. Stein
Quantity | Value | Units | Method | Reference | Comment |
---|---|---|---|---|---|
Tboil | 351.2 | K | N/A | Weast and Grasselli, 1989 | BS |
Tboil | 350. to 352. | K | N/A | Frinton Laboratories Inc., 1986 | BS |
Quantity | Value | Units | Method | Reference | Comment |
ΔvapH° | 37. | kJ/mol | E | Batt, Christie, et al., 1974 | ALS |

Gas phase ion energetics data

Data compiled by: Henry M. Rosenstock, Keith Draxl, Bruce W. Steiner, and John T. Herron
Appearance energy determinations
Ion | AE (eV) | Other Products | Method | Reference | Comment |
---|---|---|---|---|---|
C4H9+ | 10.6 | ? | EI | Tsuda and Hamill, 1966 | |
C4H9O+ | 9.94 ± 0.05 | NO | EI | Williams and Hamill, 1968 | |
NO+ | 11.48 ± 0.05 | ? | EI | Williams and Hamill, 1968 |

Normal alkane RI, non-polar column, custom temperature program

Data compiled by: NIST Mass Spectrometry Data Center, William E. Wallace, director

Column type CapillaryCapillaryCapillaryCapillaryCapillary
Active phase SPB-1SPB-1SPB-1OV-101OV-1
Column length (m) 60.60.60.50.
Carrier gas HeHeliumHeliumHe
Substrate
Column diameter (mm) 0.530.530.530.24
Phase thickness (μm) 5.5.05.0
Program 40C(6min) => 5C/min => 80C => 10C/min => 200C40 0C (6 min) 5 0C/min -> 80 0C 10 0C/min -> 200 0Cnot specifiednot specifiednot specified
I 617.617.608.575.608.
ReferenceFlanagan, Streete, et al., 1997Strete, Ruprah, et al., 1992Strete, Ruprah, et al., 1992Zenkevich and Malamakhov, 1987Ramsey and Flanagan, 1982
Comment MSDC-RI MSDC-RI MSDC-RI MSDC-RI MSDC-RI

References

Batt, Christie, et al., 1974
Batt, L.; Christie, K.; Milne, R.T.; Summers, A.J.,
Heats of formation of C1-C4 alkyl nitrites (RONO) and their RO-NO bond dissociation energies,
Int. J. Chem. Kinet., 1974, 6, 877-886. [all data]
Weast and Grasselli, 1989
CRC Handbook of Data on Organic Compounds, 2nd Editon, Weast,R.C and Grasselli, J.G., ed(s)., CRC Press, Inc., Boca Raton, FL, 1989, 1. [all data]
Frinton Laboratories Inc., 1986
Frinton Laboratories Inc.,
Catalog Number 11, Frinton Laboratories Inc., Vineland, NJ, 1986, 99. [all data]
Tsuda and Hamill, 1966
Tsuda, S.; Hamill, W.H.,
Ionization efficiency measurements by the retarding potential difference method,
Advan. Mass Spectrom., 1966, 3, 249. [all data]
Williams and Hamill, 1968
Williams, J.M.; Hamill, W.H.,
Ionization potentials of molecules and free radicals and appearance potentials by electron impact in the mass spectrometer,
J. Chem. Phys., 1968, 49, 4467. [all data]