Hexane, 1-chloro-
- Formula: C6H13Cl
- Molecular weight: 120.620
- IUPAC Standard InChIKey: MLRVZFYXUZQSRU-UHFFFAOYSA-N
- CAS Registry Number: 544-10-5
- Chemical structure:
View 3d structure (requires JavaScript / HTML 5) - Species with the same structure:
- Other names: n-Hexyl chloride; Hexyl chloride; 1-Chlorohexane; 1-Hexyl chloride

Condensed phase thermochemistry data

Data compiled by: Eugene S. Domalski and Elizabeth D. Hearing
Constant pressure heat capacity of liquid
Cp,liquid (J/mol*K) | Temperature (K) | Reference |
---|---|---|
216.2 | 298.15 | Shehatta, 1993 |

Phase change data

Data compiled as indicated in comments:
BS - Robert L. Brown and Stephen E. Stein
TRC - Thermodynamics Research Center, NIST Boulder Laboratories, Chris Muzny director
AC - William E. Acree, Jr., James S. Chickos
ALS - Hussein Y. Afeefy, Joel F. Liebman, and Stephen E. Stein
Quantity | Value | Units | Method | Reference | Comment |
---|---|---|---|---|---|
Tboil | 407.7 | K | N/A | Weast and Grasselli, 1989 | BS |
Tboil | 408.22 | K | N/A | Paul, Krug, et al., 1988 | Uncertainty assigned by TRC = 0.08 K; TRC |
Tboil | 408.1 | K | N/A | Majer and Svoboda, 1985 | |
Tboil | 407.45 | K | N/A | Mumford and Phillips, 1950 | Uncertainty assigned by TRC = 0.3 K; TRC |
Quantity | Value | Units | Method | Reference | Comment |
Tfus | 179.15 | K | N/A | Timmermans, 1952 | Uncertainty assigned by TRC = 1.2 K; TRC |
Quantity | Value | Units | Method | Reference | Comment |
Tc | 594.6 | K | N/A | Majer and Svoboda, 1985 | |
Quantity | Value | Units | Method | Reference | Comment |
ΔvapH° | 42.7 ± 0.6 | kJ/mol | AVG | N/A | Average of 6 values; Individual data points |
Enthalpy of vaporization
ΔvapH (kJ/mol) | Temperature (K) | Method | Reference | Comment |
---|---|---|---|---|
35.67 | 408.1 | N/A | Majer and Svoboda, 1985 | |
41.1 | 334. | N/A | Cabezas, Barcena, et al., 1988 | Based on data from 319. to 376. K.; AC |
43.5 | 303. | A,DTA | Stephenson and Malanowski, 1987 | Based on data from 288. to 409. K. See also Kemme and Kreps, 1969 and Dykyj, 1972.; AC |
40.5 ± 0.1 | 328. | C | Tekac, Majer, et al., 1981 | AC |
40.0 ± 0.1 | 343. | C | Tekac, Majer, et al., 1981 | AC |
39.0 ± 0.1 | 358. | C | Tekac, Majer, et al., 1981 | AC |
38.4 ± 0.1 | 368. | C | Tekac, Majer, et al., 1981 | AC |
Enthalpy of vaporization
ΔvapH =
A exp(-βTr) (1 − Tr)β
ΔvapH =
Enthalpy of vaporization (at saturation pressure)
(kJ/mol)
Tr = reduced temperature (T / Tc)
View plot Requires a JavaScript / HTML 5 canvas capable browser.
Temperature (K) | A (kJ/mol) | β | Tc (K) | Reference | Comment |
---|---|---|---|---|---|
298. to 368. | 60.06 | 0.2824 | 594.6 | Majer and Svoboda, 1985 |
Antoine Equation Parameters
log10(P) = A − (B / (T + C))
P = vapor pressure (bar)
T = temperature (K)
View plot Requires a JavaScript / HTML 5 canvas capable browser.
Temperature (K) | A | B | C | Reference |
---|---|---|---|---|
288. to 408.8 | 3.89376 | 1304.968 | -73.092 | Kemme and Kreps, 1969 |

Henry's Law data

Data compiled by: Rolf Sander
Henry's Law constant (water solution)
kH(T) = k°H exp(d(ln(kH))/d(1/T) ((1/T) - 1/(298.15 K)))
k°H = Henry's law constant for solubility in water at 298.15 K (mol/(kg*bar))
d(ln(kH))/d(1/T) = Temperature dependence constant (K)
k°H (mol/(kg*bar)) | d(ln(kH))/d(1/T) (K) | Method | Reference |
---|---|---|---|
0.041 | 4500. | X | Leighton and Calo, 1981 |

Gas phase ion energetics data

Data compiled by: Sharon G. Lias and Joel F. Liebman
Ionization energy determinations
IE (eV) | Method | Reference |
---|---|---|
10.31 | EST | Luo and Pacey, 1992 |
10.28 ± 0.05 | EI | Holmes and Lossing, 1991 |

Kovats' RI, non-polar column, isothermal

View large format table.

Column type Active phase Temperature (C) I Reference Comment
CapillaryHP-10.840.1Wang, Liu, et al., 200530. m/0.25 mm/0.25 μm
CapillaryHP-110.838.8Wang, Liu, et al., 200530. m/0.25 mm/0.25 μm
CapillaryHP-120.839.5Wang, Liu, et al., 200530. m/0.25 mm/0.25 μm
CapillaryHP-130.837.4Wang, Liu, et al., 200530. m/0.25 mm/0.25 μm
CapillaryHP-140.835.Wang, Liu, et al., 200530. m/0.25 mm/0.25 μm
CapillaryHP-150.833.7Wang, Liu, et al., 200530. m/0.25 mm/0.25 μm
CapillaryHP-120.836.7Koutek, Cvacka, et al., 20016. m/0.310 mm/0.52 μm, He
CapillaryHP-120.840.9Koutek, Cvacka, et al., 20016. m/0.310 mm/0.52 μm, He
PackedC78, Branched paraffin130.843.7Dallos, Sisak, et al., 2000He; Column length: 3.3 m
PackedC78, Branched paraffin130.842.9Reddy, Dutoit, et al., 1992Chromosorb G HP; Column length: 3.3 m
PackedApolane130.844.Dutoit, 1991Column length: 3.7 m
CapillaryOV-160.842.9Guan, Kiraly, et al., 198925. m/0.31 mm/0.52 μm, He
CapillaryOV-175.844.6Guan, Kiraly, et al., 198925. m/0.31 mm/0.52 μm, He
CapillarySE-5460.858.2Guan, Kiraly, et al., 198925. m/0.31 mm/0.52 μm, He
CapillarySE-5475.859.7Guan, Kiraly, et al., 198925. m/0.31 mm/0.52 μm, He
CapillaryApiezon L90.857.Morishita, Terashima, et al., 1983He; Column length: 45. m; Column diameter: 0.25 mm
PackedApolane70.833.3Riedo, Fritz, et al., 1976He, Chromosorb; Column length: 2.4 m
CapillarySqualane100.838.3Schomburg and Dielmann, 1973Column length: 100. m; Column diameter: 0.25 mm
PackedApiezon L130.835.von Kováts, 1958Celite (40:60 Gewichtsverhaltnis)

Kovats' RI, polar column, isothermal

View large format table.

Column type Active phase Temperature (C) I Reference Comment
PackedCarbowax 20M100.1034.Castello and D'Amato, 1986He, Chromosorb W AW DMC; Column length: 3. m
PackedCarbowax 20M125.1041.Castello and D'Amato, 1986He, Chromosorb W AW DMC; Column length: 3. m
PackedCarbowax 20M75.1041.Castello and D'Amato, 1986He, Chromosorb W AW DMC; Column length: 3. m
CapillaryPEG-20M90.1050.Morishita, Terashima, et al., 1983He; Column length: 75. m; Column diameter: 0.25 mm

Van Den Dool and Kratz RI, non-polar column, temperature ramp

View large format table.

Column type Active phase I Reference Comment
CapillarySPB-5858.Engel and Ratel, 200760. m/0.32 mm/1. μm, 40. C @ 2. min, 3. K/min, 230. C @ 10. min
CapillaryDB-1835.9Sun and Stremple, 200330. m/0.25 mm/0.25 μm, He, 3. K/min; Tstart: 40. C; Tend: 325. C
CapillaryDB-5857.1Xu, van Stee, et al., 200330. m/0.25 mm/1. μm, He, 2.5 K/min; Tstart: 50. C; Tend: 200. C
CapillaryPetrocol DH840.White, Hackett, et al., 1992100. m/0.25 mm/0.5 μm, He, 1. K/min; Tstart: 30. C; Tend: 220. C
CapillarySE-54858.Weber, 198625. m/0.31 mm/0.17 μm, H2, 2. K/min; Tstart: 35. C

Van Den Dool and Kratz RI, non-polar column, custom temperature program

View large format table.

Column type Active phase I Reference Comment
CapillaryDB-1844.Peng, 200015. m/0.53 mm/1. μm, He; Program: 40C(3min) => 8C/min => 200(1min) => 5C/min => 300C(25min)

Van Den Dool and Kratz RI, polar column, temperature ramp

View large format table.

Column type Active phase I Reference Comment
CapillaryDB-Wax1047.Peng, 200015. m/0.53 mm/1. μm, He, 40. C @ 3. min, 5. K/min, 220. C @ 30. min
CapillaryHP-Wax1049.Peng, 200015. m/0.53 mm/1. μm, He, 40. C @ 3. min, 5. K/min, 220. C @ 30. min

Normal alkane RI, non-polar column, isothermal

View large format table.

Column type Active phase Temperature (C) I Reference Comment
CapillaryPolydimethyl siloxane105.848.Tello, Lebron-Aguilar, et al., 2009
CapillaryPolydimethyl siloxane75.844.Tello, Lebron-Aguilar, et al., 2009
CapillaryPolydimethyl siloxane90.846.Tello, Lebron-Aguilar, et al., 2009
CapillaryApiezon L130.857.Arruda, Junkes, et al., 2008
CapillaryMethyl Silicone100.847.Lebrón-Aguilar, Quintanilla-López, et al., 2007
CapillaryMethyl Silicone120.850.Lebrón-Aguilar, Quintanilla-López, et al., 2007
CapillaryMethyl Silicone140.853.Lebrón-Aguilar, Quintanilla-López, et al., 2007
CapillaryMethyl Silicone80.845.Lebrón-Aguilar, Quintanilla-López, et al., 2007

Normal alkane RI, non-polar column, temperature ramp

View large format table.

Column type Active phase I Reference Comment
CapillaryOV-101845.Dimov and Milina, 1989H2, 2. K/min; Column length: 50. m; Column diameter: 0.32 mm; Tstart: 40. C; Tend: 280. C

Normal alkane RI, non-polar column, custom temperature program

View large format table.

Column type Active phase I Reference Comment
CapillaryMethyl Silicone844.Zenkevich, 1999Program: not specified
CapillaryOV-1, SE-30, Methyl silicone, SP-2100, OV-101, DB-1, etc.844.Waggott and Davies, 1984Hydrogen; Column length: 50. m; Column diameter: 0.32 mm; Program: not specified

Normal alkane RI, polar column, custom temperature program

View large format table.

Column type Active phase I Reference Comment
CapillaryDB-Wax1050.Peng, Yang, et al., 1991Program: not specified

References

Shehatta, 1993
Shehatta, I.,
Heat capacity at constant pressure of some halogen compounds,
Thermochim. Acta, 1993, 213, 1-10. [all data]
Weast and Grasselli, 1989
CRC Handbook of Data on Organic Compounds, 2nd Editon, Weast,R.C and Grasselli, J.G., ed(s)., CRC Press, Inc., Boca Raton, FL, 1989, 1. [all data]
Paul, Krug, et al., 1988
Paul, H.-I.; Krug, J.; Knapp, H.,
Measurements of VLE, vE, and hE for binary mixtures of 1-chlorohexane with three n-alkylbenzenes: toluene, ethylbenzene, n-propylbenzene,
J. Chem. Eng. Data, 1988, 33, 453. [all data]
Majer and Svoboda, 1985
Majer, V.; Svoboda, V.,
Enthalpies of Vaporization of Organic Compounds: A Critical Review and Data Compilation, Blackwell Scientific Publications, Oxford, 1985, 300. [all data]
Mumford and Phillips, 1950
Mumford, S.A.; Phillips, J.W.C.,
19. The Physical Properties of Some Aliphatic Compounds,
J. Chem. Soc., 1950, 1950, 75-84. [all data]
Timmermans, 1952
Timmermans, J.,
Freezing points of organic compounds. VVI New determinations.,
Bull. Soc. Chim. Belg., 1952, 61, 393. [all data]
Cabezas, Barcena, et al., 1988
Cabezas, Jose L.; Barcena, Lucas A.; Coca, Jose; Cockrem, Michael,
Extraction of furfural from aqueous solutions using alcohols,
J. Chem. Eng. Data, 1988, 33, 4, 435-437, https://doi.org/10.1021/je00054a014
. [all data]
Stephenson and Malanowski, 1987
Stephenson, Richard M.; Malanowski, Stanislaw,
Handbook of the Thermodynamics of Organic Compounds, 1987, https://doi.org/10.1007/978-94-009-3173-2
. [all data]
Kemme and Kreps, 1969
Kemme, Herbert R.; Kreps, Saul I.,
Vapor pressure of primary n-alkyl chlorides and alcohols,
J. Chem. Eng. Data, 1969, 14, 1, 98-102, https://doi.org/10.1021/je60040a011
. [all data]
Dykyj, 1972
Dykyj, J.,
Petrochemia, 1972, 12, 1, 13. [all data]
Tekac, Majer, et al., 1981
Tekac, V.; Majer, V.; Svoboda, V.; Hynek, V.,
Enthalpies of vaporization and cohesive energies for six monochlorinated alkanes,
J. Chem. Thermodyn., 1981, 13, 659-662. [all data]
Leighton and Calo, 1981
Leighton, D.T.; Calo, J.M.,
Distribution Coefficients of Chlorinated Hydrocarbons in Dilute Air-Water Systems for Groundwater Contamination Applications,
J. Chem. Eng. Data, 1981, 26, 382-385. [all data]
Luo and Pacey, 1992
Luo, Y.-R.; Pacey, P.D.,
Effects of alkyl substitution on ionization energies of alkanes and haloalkanes and on heats of formation of their molecular cations. Part 2. Alkanes and chloro-, bromo- and iodoalkanes,
Int. J. Mass Spectrom. Ion Processes, 1992, 112, 63. [all data]
Holmes and Lossing, 1991
Holmes, J.L.; Lossing, F.P.,
Ionization energies of homologous organic compounds and correlation with molecular size,
Org. Mass Spectrom., 1991, 26, 537. [all data]