Cyclopropane, tetramethylmethylene-

Reaction thermochemistry data

Data compiled by: Hussein Y. Afeefy, Joel F. Liebman, and Stephen E. Stein

Individual Reactions

Cyclopropane, tetramethylmethylene- = Cyclopropane, 1,1-dimethyl-2-(1-methylethylidene)

By formula: C8H14 = C8H14

Quantity Value Units Method Reference Comment
Δr-21.7 ± 0.63kJ/molEqkCrawford and Tokunaga, 1974gas phase

Gas phase ion energetics data

Data compiled by: Sharon G. Lias and Joel F. Liebman

Ionization energy determinations

IE (eV) Method Reference Comment
9.22PEKindermann, Poppek, et al., 1990Vertical value

References

Crawford and Tokunaga, 1974
Crawford, R.J.; Tokunaga, H., Thermolysis of 3,3,5,5-tetramethyl-4-methylene-1-pyrazoline and the thermal isomerization of some alkylidenecyclopropanes, Can. J. Chem., 1974, 52, 4033-4039. [all data]

Kindermann, Poppek, et al., 1990
Kindermann, M.K.; Poppek, R.; Rademacher, P.; Fub, A.; Quast, H., Gas-phase thermolysis of 4-substituted 3,5-dihydro-3,3,5,5-tetramethyl-4H-pyrazoles studied by photoelectron spectroscopy and flash vacuum pyrolysis, Chem. Ber., 1990, 123, 1161. [all data]