Propyl nitrite
- Formula: C3H7NO2
- Molecular weight: 89.0932
- IUPAC Standard InChIKey: KAOQVXHBVNKNHA-UHFFFAOYSA-N
- CAS Registry Number: 543-67-9
- Chemical structure:
View 3d structure (requires JavaScript / HTML 5) - Other names: n-C3H7ONO; n-Propyl nitrite; Nitrous acid, propyl ester; Nitrous acid, n-propyl ester; Propanol nitrite

Gas phase thermochemistry data

Data compiled by: Hussein Y. Afeefy, Joel F. Liebman, and Stephen E. Stein
Quantity | Value | Units | Method | Reference | Comment |
---|---|---|---|---|---|
ΔfH°gas | -119. ± 4.2 | kJ/mol | Ccb | Batt, Christie, et al., 1974 |

Condensed phase thermochemistry data

Data compiled by: Hussein Y. Afeefy, Joel F. Liebman, and Stephen E. Stein
Quantity | Value | Units | Method | Reference | Comment |
---|---|---|---|---|---|
ΔfH°liquid | -151. | kJ/mol | Ccb | Batt, Christie, et al., 1974 | |
Quantity | Value | Units | Method | Reference | Comment |
ΔcH°liquid | -2030. ± 1. | kJ/mol | Ccb | Batt, Christie, et al., 1974 |

Phase change data

Data compiled as indicated in comments:
BS - Robert L. Brown and Stephen E. Stein
TRC - Thermodynamics Research Center, NIST Boulder Laboratories, Chris Muzny director
ALS - Hussein Y. Afeefy, Joel F. Liebman, and Stephen E. Stein
AC - William E. Acree, Jr., James S. Chickos
Quantity | Value | Units | Method | Reference | Comment |
---|---|---|---|---|---|
Tboil | 330. | K | N/A | Frinton Laboratories Inc., 1986 | BS |
Tboil | 320.90 | K | N/A | Lecat, 1947 | Uncertainty assigned by TRC = 0.4 K; TRC |
Quantity | Value | Units | Method | Reference | Comment |
ΔvapH° | 32. | kJ/mol | E | Batt, Christie, et al., 1974 | ALS |
Enthalpy of vaporization
ΔvapH (kJ/mol) | Temperature (K) | Method | Reference | Comment |
---|---|---|---|---|
28.3 | 260. | A | Stephenson and Malanowski, 1987 | Based on data from 253. to 268. K. See also Thompson and Dainton, 1937.; AC |

Gas phase ion energetics data

Data compiled as indicated in comments:
RDSH - Henry M. Rosenstock, Keith Draxl, Bruce W. Steiner, and John T. Herron
Ionization energy determinations
IE (eV) | Method | Reference | Comment |
---|---|---|---|
10.34 ± 0.01 | PE | Dewar, Shanshal, et al., 1969 | RDSH |

Normal alkane RI, non-polar column, temperature ramp

Column type | Active phase | I | Reference | Comment |
---|---|---|---|---|
Capillary | OV-101 | 486. | Zenkevich, 2005 | 25. m/0.20 mm/0.10 μm, N2/He, 6. K/min; Tstart: 50. C; Tend: 250. C |

References

Batt, Christie, et al., 1974
Batt, L.; Christie, K.; Milne, R.T.; Summers, A.J.,
Heats of formation of C1-C4 alkyl nitrites (RONO) and their RO-NO bond dissociation energies,
Int. J. Chem. Kinet., 1974, 6, 877-886. [all data]
Frinton Laboratories Inc., 1986
Frinton Laboratories Inc.,
Catalog Number 11, Frinton Laboratories Inc., Vineland, NJ, 1986, 99. [all data]
Lecat, 1947
Lecat, M.,
Orthobaric Azeotropes of Sulfides,
Bull. Cl. Sci., Acad. R. Belg., 1947, 33, 160-82. [all data]
Stephenson and Malanowski, 1987
Stephenson, Richard M.; Malanowski, Stanislaw,
Handbook of the Thermodynamics of Organic Compounds, 1987, https://doi.org/10.1007/978-94-009-3173-2
. [all data]
Thompson and Dainton, 1937
Thompson, H.W.; Dainton, F.S.,
The photochemistry of alkyl nitrites. III,
Trans. Faraday Soc., 1937, 33, 1546, https://doi.org/10.1039/tf9373301546
. [all data]
Dewar, Shanshal, et al., 1969
Dewar, M.J.S.; Shanshal, M.; Worley, S.D.,
Calculated and observed ionization potentials gf nitroalkanes and of nitrous and nitric acids and esters. Extension of the MINDO method to nitrogen-oxygen compounds,
J. Am. Chem. Soc., 1969, 91, 3590. [all data]
Zenkevich, 2005
Zenkevich, I.G.,
Experimentally measured retention indices., 2005. [all data]