Pentane, 1-chloro-
- Formula: C5H11Cl
- Molecular weight: 106.594
- IUPAC Standard InChIKey: SQCZQTSHSZLZIQ-UHFFFAOYSA-N
- CAS Registry Number: 543-59-9
- Chemical structure:
View 3d structure (requires JavaScript / HTML 5) - Other names: n-Amyl chloride; n-Pentyl chloride; Amyl chloride; Pentyl chloride; 1-Chloropentane; UN 1107

Gas phase thermochemistry data

Data compiled by: Hussein Y. Afeefy, Joel F. Liebman, and Stephen E. Stein
Quantity | Value | Units | Method | Reference | Comment |
---|---|---|---|---|---|
ΔfH°gas | -175.2 ± 1.3 | kJ/mol | Ccr | Stridth and Sunner, 1975 |

Condensed phase thermochemistry data

Data compiled as indicated in comments:
ALS - Hussein Y. Afeefy, Joel F. Liebman, and Stephen E. Stein
DH - Eugene S. Domalski and Elizabeth D. Hearing
Quantity | Value | Units | Method | Reference | Comment |
---|---|---|---|---|---|
ΔfH°liquid | -213.4 ± 1.3 | kJ/mol | Ccr | Stridth and Sunner, 1975 | ALS |
ΔfH°liquid | -212. ± 3. | kJ/mol | Ccr | Bjellerup and Smith, 1954 | At 293 K, see Smith, Bjellerup, et al., 1953; ALS |
Quantity | Value | Units | Method | Reference | Comment |
ΔcH°liquid | -3349.9 ± 1.2 | kJ/mol | Ccr | Stridth and Sunner, 1975 | ALS |
ΔcH°liquid | -3352. ± 3. | kJ/mol | Ccr | Bjellerup and Smith, 1954 | At 293 K, see Smith, Bjellerup, et al., 1953; ALS |
ΔcH°liquid | -3344.6 | kJ/mol | Ccr | Smith, Bjellerup, et al., 1953 | ALS |
Constant pressure heat capacity of liquid
Cp,liquid (J/mol*K) | Temperature (K) | Reference | Comment |
---|---|---|---|
187.7 | 298.15 | Shehatta, 1993 | DH |

Phase change data

Data compiled as indicated in comments:
BS - Robert L. Brown and Stephen E. Stein
TRC - Thermodynamics Research Center, NIST Boulder Laboratories, Chris Muzny director
AC - William E. Acree, Jr., James S. Chickos
ALS - Hussein Y. Afeefy, Joel F. Liebman, and Stephen E. Stein
Quantity | Value | Units | Method | Reference | Comment |
---|---|---|---|---|---|
Tboil | 381. ± 1. | K | AVG | N/A | Average of 7 values; Individual data points |
Quantity | Value | Units | Method | Reference | Comment |
Tc | 568.5 | K | N/A | Majer and Svoboda, 1985 | |
Quantity | Value | Units | Method | Reference | Comment |
ΔvapH° | 38.3 ± 0.4 | kJ/mol | AVG | N/A | Average of 6 values; Individual data points |
Reduced pressure boiling point
Tboil (K) | Pressure (bar) | Reference | Comment |
---|---|---|---|
278.2 | 0.013 | Weast and Grasselli, 1989 | BS |
Enthalpy of vaporization
ΔvapH (kJ/mol) | Temperature (K) | Method | Reference | Comment |
---|---|---|---|---|
33.15 | 380.9 | N/A | Majer and Svoboda, 1985 | |
38.7 | 292. | A,EST | Stephenson and Malanowski, 1987 | Based on data from 277. to 421. K. See also Li and Rossini, 1961.; AC |
37.3 | 313. | C | Tekac, Majer, et al., 1981 | AC |
36.5 | 328. | C | Tekac, Majer, et al., 1981 | AC |
35.6 | 343. | C | Tekac, Majer, et al., 1981 | AC |
34.6 | 358. | C | Tekac, Majer, et al., 1981 | AC |
34.0 | 363. | C | Tekac, Majer, et al., 1981 | AC |
36.2 | 303. | N/A | Rintelen, Saylor, et al., 1937 | Based on data from 283. to 323. K.; AC |
33.2 | 378. | V | Mathews and Fehlandt, 1931 | ALS |
Enthalpy of vaporization
ΔvapH =
A exp(-βTr) (1 − Tr)β
ΔvapH =
Enthalpy of vaporization (at saturation pressure)
(kJ/mol)
Tr = reduced temperature (T / Tc)
View plot Requires a JavaScript / HTML 5 canvas capable browser.
Temperature (K) | A (kJ/mol) | β | Tc (K) | Reference | Comment |
---|---|---|---|---|---|
298. to 368. | 54.5 | 0.2794 | 568.5 | Majer and Svoboda, 1985 |

Henry's Law data

Data compiled by: Rolf Sander
Henry's Law constant (water solution)
kH(T) = k°H exp(d(ln(kH))/d(1/T) ((1/T) - 1/(298.15 K)))
k°H = Henry's law constant for solubility in water at 298.15 K (mol/(kg*bar))
d(ln(kH))/d(1/T) = Temperature dependence constant (K)
k°H (mol/(kg*bar)) | d(ln(kH))/d(1/T) (K) | Method | Reference | Comment |
---|---|---|---|---|
0.020 | Q | N/A | missing citation give several references for the Henry's law constants but don't assign them to specific species. | |
0.042 | 4700. | X | Leighton and Calo, 1981 | |
0.046 | V | N/A |

Gas phase ion energetics data

Data compiled as indicated in comments:
LL - Sharon G. Lias and Joel F. Liebman
RDSH - Henry M. Rosenstock, Keith Draxl, Bruce W. Steiner, and John T. Herron
Ionization energy determinations
IE (eV) | Method | Reference | Comment |
---|---|---|---|
10.47 | EST | Luo and Pacey, 1992 | LL |
Appearance energy determinations
Ion | AE (eV) | Other Products | Method | Reference | Comment |
---|---|---|---|---|---|
C5H10+ | 10.56 ± 0.05 | HCl | EI | Harnish, Holmes, et al., 1990 | LL |
C5H10+ | 10.63 | HCl | EI | Lorquet-Julien, 1961 | RDSH |

Kovats' RI, non-polar column, isothermal

Column type | Active phase | Temperature (C) | I | Reference | Comment |
---|---|---|---|---|---|
Packed | C78, Branched paraffin | 130. | 742.2 | Dallos, Sisak, et al., 2000 | He; Column length: 3.3 m |
Packed | C78, Branched paraffin | 130. | 741.7 | Reddy, Dutoit, et al., 1992 | Chromosorb G HP; Column length: 3.3 m |
Packed | Apolane | 130. | 742. | Dutoit, 1991 | Column length: 3.7 m |
Capillary | Apiezon L | 90. | 762. | Morishita, Terashima, et al., 1983 | He; Column length: 45. m; Column diameter: 0.25 mm |
Packed | Apolane | 70. | 732.2 | Riedo, Fritz, et al., 1976 | He, Chromosorb; Column length: 2.4 m |
Packed | Squalane | 27. | 722. | Hively and Hinton, 1968 | He, Chromosorb P; Column length: 15. m; Column diameter: 0.25 mm |
Packed | Squalane | 49. | 725. | Hively and Hinton, 1968 | He, Chromosorb P; Column length: 15. m; Column diameter: 0.25 mm |
Packed | Squalane | 67. | 729. | Hively and Hinton, 1968 | He, Chromosorb P; Column length: 15. m; Column diameter: 0.25 mm |
Packed | Squalane | 86. | 730. | Hively and Hinton, 1968 | He, Chromosorb P; Column length: 15. m; Column diameter: 0.25 mm |
Packed | Apiezon L | 130. | 754. | von Kováts, 1958 | Celite (40:60 Gewichtsverhaltnis) |
Packed | Apiezon L | 70. | 756. | von Kováts, 1958 | Celite (40:60 Gewichtsverhaltnis) |

Kovats' RI, polar column, isothermal

Column type | Active phase | Temperature (C) | I | Reference | Comment |
---|---|---|---|---|---|
Packed | Carbowax 20M | 100. | 938. | Castello and D'Amato, 1986 | He, Chromosorb W AW DMC; Column length: 3. m |
Packed | Carbowax 20M | 125. | 945. | Castello and D'Amato, 1986 | He, Chromosorb W AW DMC; Column length: 3. m |
Packed | Carbowax 20M | 75. | 943. | Castello and D'Amato, 1986 | He, Chromosorb W AW DMC; Column length: 3. m |
Capillary | PEG-20M | 90. | 953. | Morishita, Terashima, et al., 1983 | He; Column length: 75. m; Column diameter: 0.25 mm |

Van Den Dool and Kratz RI, non-polar column, temperature ramp

Column type | Active phase | I | Reference | Comment |
---|---|---|---|---|
Capillary | DB-5 | 754.2 | Xu, van Stee, et al., 2003 | 30. m/0.25 mm/1. μm, He, 2.5 K/min; Tstart: 50. C; Tend: 200. C |
Capillary | Petrocol DH | 736. | White, Hackett, et al., 1992 | 100. m/0.25 mm/0.5 μm, He, 1. K/min; Tstart: 30. C; Tend: 220. C |

Van Den Dool and Kratz RI, non-polar column, custom temperature program

Column type | Active phase | I | Reference | Comment |
---|---|---|---|---|
Capillary | DB-1 | 739. | Peng, 2000 | 15. m/0.53 mm/1. μm, He; Program: 40C(3min) => 8C/min => 200(1min) => 5C/min => 300C(25min) |

Van Den Dool and Kratz RI, polar column, temperature ramp

Column type | Active phase | I | Reference | Comment |
---|---|---|---|---|
Capillary | DB-Wax | 946. | Peng, 2000 | 15. m/0.53 mm/1. μm, He, 40. C @ 3. min, 5. K/min, 220. C @ 30. min |
Capillary | HP-Wax | 941. | Peng, 2000 | 15. m/0.53 mm/1. μm, He, 40. C @ 3. min, 5. K/min, 220. C @ 30. min |

Normal alkane RI, non-polar column, isothermal

Column type | Active phase | Temperature (C) | I | Reference | Comment |
---|---|---|---|---|---|
Capillary | Polydimethyl siloxane | 105. | 747. | Tello, Lebron-Aguilar, et al., 2009 | |
Capillary | Polydimethyl siloxane | 75. | 743. | Tello, Lebron-Aguilar, et al., 2009 | |
Capillary | Polydimethyl siloxane | 90. | 744. | Tello, Lebron-Aguilar, et al., 2009 | |
Capillary | Apiezon L | 130. | 762. | Arruda, Junkes, et al., 2008 | |
Capillary | Methyl Silicone | 100. | 746. | Lebrón-Aguilar, Quintanilla-López, et al., 2007 | |
Capillary | Methyl Silicone | 120. | 748. | Lebrón-Aguilar, Quintanilla-López, et al., 2007 | |
Capillary | Methyl Silicone | 140. | 751. | Lebrón-Aguilar, Quintanilla-López, et al., 2007 | |
Capillary | Methyl Silicone | 80. | 744. | Lebrón-Aguilar, Quintanilla-López, et al., 2007 |

Normal alkane RI, non-polar column, temperature ramp

Column type | Active phase | I | Reference | Comment |
---|---|---|---|---|
Capillary | OV-101 | 742. | Dimov and Milina, 1989 | H2, 2. K/min; Column length: 50. m; Column diameter: 0.32 mm; Tstart: 40. C; Tend: 280. C |

Normal alkane RI, non-polar column, custom temperature program

Column type | Active phase | I | Reference | Comment |
---|---|---|---|---|
Capillary | Polydimethyl siloxanes | 740. | Zenkevich and Chupalov, 1996 | Program: not specified |
Packed | Apiezon L | 751.1 | Keiko, Prokop'ev, et al., 1972 | Program: not specified |
Packed | Squalane | 743.4 | Keiko, Prokop'ev, et al., 1972 | Program: not specified |

Normal alkane RI, polar column, custom temperature program

Column type | Active phase | I | Reference | Comment |
---|---|---|---|---|
Capillary | DB-Wax | 945. | Peng, Yang, et al., 1991 | Program: not specified |

References

Stridth and Sunner, 1975
Stridth, G.; Sunner, S.,
Enthalpies of formation of some 1-chloroalkanes and the CH2-increment in the 1-chloroalkanes series,
J. Chem. Thermodyn., 1975, 7, 161-168. [all data]
Bjellerup and Smith, 1954
Bjellerup, L.; Smith, L.,
Heats of combustion of some organic chloro-compounds,
Kgl. Fysiograph. Sallskap. Lund Forh., 1954, 24, 1-13. [all data]
Smith, Bjellerup, et al., 1953
Smith, L.; Bjellerup, L.; Krook, S.; Westermark, H.,
Heats of combustion of organic chloro compounds determined by the "quartz wool" method,
Acta Chem. Scand., 1953, 7, 65. [all data]
Shehatta, 1993
Shehatta, I.,
Heat capacity at constant pressure of some halogen compounds,
Thermochim. Acta, 1993, 213, 1-10. [all data]
Majer and Svoboda, 1985
Majer, V.; Svoboda, V.,
Enthalpies of Vaporization of Organic Compounds: A Critical Review and Data Compilation, Blackwell Scientific Publications, Oxford, 1985, 300. [all data]
Weast and Grasselli, 1989
CRC Handbook of Data on Organic Compounds, 2nd Editon, Weast,R.C and Grasselli, J.G., ed(s)., CRC Press, Inc., Boca Raton, FL, 1989, 1. [all data]
Stephenson and Malanowski, 1987
Stephenson, Richard M.; Malanowski, Stanislaw,
Handbook of the Thermodynamics of Organic Compounds, 1987, https://doi.org/10.1007/978-94-009-3173-2
. [all data]
Li and Rossini, 1961
Li, J.C.M.; Rossini, F.D.,
Vapor Pressures and Boiling Points of the l-Fluoroalkanes, l-Chloroalkanes, l-Bromoalkanes, and l-Iodoalkanes, C 1 to C 20 .,
J. Chem. Eng. Data, 1961, 6, 2, 268-270, https://doi.org/10.1021/je60010a025
. [all data]
Tekac, Majer, et al., 1981
Tekac, V.; Majer, V.; Svoboda, V.; Hynek, V.,
Enthalpies of vaporization and cohesive energies for six monochlorinated alkanes,
J. Chem. Thermodyn., 1981, 13, 659-662. [all data]
Rintelen, Saylor, et al., 1937
Rintelen, J.C.; Saylor, J.H.; Gross, P.M.,
The Densities and Vapor Pressures of Some Alkylbenzenes, Aliphatic Ketones and n-Amyl Chloride 1,
J. Am. Chem. Soc., 1937, 59, 6, 1129-1130, https://doi.org/10.1021/ja01285a050
. [all data]
Mathews and Fehlandt, 1931
Mathews, J.H.; Fehlandt, P.R.,
The heats of vaporization of some organic compounds,
J. Am. Chem. Soc., 1931, 53, 3212-32. [all data]
Leighton and Calo, 1981
Leighton, D.T.; Calo, J.M.,
Distribution Coefficients of Chlorinated Hydrocarbons in Dilute Air-Water Systems for Groundwater Contamination Applications,
J. Chem. Eng. Data, 1981, 26, 382-385. [all data]
Luo and Pacey, 1992
Luo, Y.-R.; Pacey, P.D.,
Effects of alkyl substitution on ionization energies of alkanes and haloalkanes and on heats of formation of their molecular cations. Part 2. Alkanes and chloro-, bromo- and iodoalkanes,
Int. J. Mass Spectrom. Ion Processes, 1992, 112, 63. [all data]
Harnish, Holmes, et al., 1990
Harnish, D.; Holmes, J.L.; Lossing, F.P.; Mommers, A.A.; Maccoll, A.; Mruzek, M.N.,
Assigining structures to isomeric [C5H10]+ Ions: the generation of ionized ethylcyclopropane from pentan-1-ol and 1-chloropentane,
Org. Mass Spectrom., 1990, 25, 381. [all data]
Lorquet-Julien, 1961
Lorquet-Julien, J.C.,
Comportement du 1 fluoro- et du 1 chloropentane normal et des derives halogenescorrespondants du cyclopentane sous l'impact electronique,
Bull. Soc. Roy. Sci. Liege, 1961, 30, 170. [all data]