Plumbane,trimethyl(phenylmethyl)-
- Formula: C10H16Pb
- Molecular weight: 343.4
- IUPAC Standard InChIKey: QWJAPVZEQSMLNM-UHFFFAOYSA-N
- CAS Registry Number: 54338-54-4
- Chemical structure:
View 3d structure (requires JavaScript / HTML 5) - Permanent link for this species. Use this link for bookmarking this species for future reference.

Gas phase ion energetics data

Data compiled by: Sharon G. Lias, Rhoda D. Levin, and Sherif A. Kafafi
Ionization energy determinations
IE (eV) | Method | Reference |
---|---|---|
7.87 ± 0.05 | PE | Distefano, Pignataro, et al., 1974 |

References

Distefano, Pignataro, et al., 1974
Distefano, G.; Pignataro, S.; Ricci, A.; Colonna, F.P.; Pietropaolo, D.,
Interactions of π-orbitals with the group IV elements studied by ionization energy measurements,
Ann. Chim., 1974, 64, 153. [all data]