5-chloro-1H-pyrimidin-2-one
- Formula: C4H3ClN2O
- Molecular weight: 130.532
- IUPAC Standard InChIKey: OCSYCDVQABSEPJ-UHFFFAOYSA-N
- CAS Registry Number: 54326-16-8
- Chemical structure:
View 3d structure (requires JavaScript / HTML 5) - Other names: 2(1H)-Pyrimidinone, 5-chloro-

Gas phase ion energetics data

Data compiled by: Sharon G. Lias, Rhoda D. Levin, and Sherif A. Kafafi
Ionization energy determinations
IE (eV) | Method | Reference |
---|---|---|
9.78 ± 0.05 | EI | Gacek, Thorstad, et al., 1978 |

References

Gacek, Thorstad, et al., 1978
Gacek, M.; Thorstad, O.; Ongstad, L.; Undheim, K.,
Ionisation potentials in tautomer analysis of 2-hydroxypyrimidines,
Chem. Scr., 1978, 13, 99. [all data]