Glycine, N-acetyl-
- Formula: C4H7NO3
- Molecular weight: 117.1033
- IUPAC Standard InChIKey: OKJIRPAQVSHGFK-UHFFFAOYSA-N
- CAS Registry Number: 543-24-8
- Chemical structure:

Reaction thermochemistry data

Data compiled by: Robert C. Dunbar
Individual Reactions
By formula: Na+ + C4H7NO3 = (Na+ • C4H7NO3)
Quantity | Value | Units | Method | Reference | Comment |
---|---|---|---|---|---|
ΔrH° | 41.1 ± 1.7 | kcal/mol | CIDC | Cerda, Hoyau, et al., 1998 |
Free energy of reaction
ΔrG° (kcal/mol) | T (K) | Method | Reference |
---|---|---|---|
30.8 | 0. | CIDC | Feng, Gronert, et al., 1999 |

Gas phase ion energetics data

Data compiled as indicated in comments:
LBLHLM - Sharon G. Lias, John E. Bartmess, Joel F. Liebman, John L. Holmes, Rhoda D. Levin, and W. Gary Mallard
Ionization energy determinations
IE (eV) | Method | Reference | Comment |
---|---|---|---|
9.4 | PE | Cannington and Ham, 1983 | LBLHLM |
9.8 | PE | Cannington and Ham, 1983 | Vertical value; LBLHLM |

Ion clustering data

Data compiled by: Robert C. Dunbar
Clustering reactions
By formula: Na+ + C4H7NO3 = (Na+ • C4H7NO3)
Quantity | Value | Units | Method | Reference | Comment |
---|---|---|---|---|---|
ΔrH° | 41.1 ± 1.7 | kcal/mol | CIDC | Cerda, Hoyau, et al., 1998 |
Free energy of reaction
ΔrG° (kcal/mol) | T (K) | Method | Reference |
---|---|---|---|
30.8 | 0. | CIDC | Feng, Gronert, et al., 1999 |

References

Cerda, Hoyau, et al., 1998
Cerda, B.A.; Hoyau, S.; Ohanessian, G.; Wesdemiotis, C.,
PAs of Peptides,
J. Am. Chem. Soc., 1998, 120, 2437. [all data]
Feng, Gronert, et al., 1999
Feng, W.Y.; Gronert, S.; Lebrilla, C.B.,
Lithium and sodium ion binding energies of N-acetyl and N-glycyl amino acids,
J. Am. Chem. Soc., 1999, 121, 6, 1365, https://doi.org/10.1021/ja983116s
. [all data]
Cannington and Ham, 1983
Cannington, P.H.; Ham, N.S.,
He(I) and He(II) photoelectron spectra of glycine and related molecules,
J. Electron Spectrosc. Relat. Phenom., 1983, 32, 139. [all data]