1,3-Cyclopentadiene
- Formula: C5H6
- Molecular weight: 66.1011
- IUPAC Standard InChIKey: ZSWFCLXCOIISFI-UHFFFAOYSA-N
- CAS Registry Number: 542-92-7
- Chemical structure:
View 3d structure (requires JavaScript / HTML 5) - Other names: Cyclopentadiene; Pentole; Pyropentylene; R-Pentine

Gas phase thermochemistry data

Data compiled as indicated in comments:
ALS - Hussein Y. Afeefy, Joel F. Liebman, and Stephen E. Stein
GT - Glushko Thermocenter, Russian Academy of Sciences, Moscow
Quantity | Value | Units | Method | Reference | Comment |
---|---|---|---|---|---|
ΔfH°gas | 139. | kJ/mol | Chyd | Roth, Adamczak, et al., 1991 | ALS |
ΔfH°gas | 133.4 | kJ/mol | Eqk | Furuyama, Golden, et al., 1970 | ALS |
Quantity | Value | Units | Method | Reference | Comment |
ΔcH°gas | -2960. ± 30. | kJ/mol | Ccb | Wassermann, 1935 | Corresponding ΔfHºgas = 130. kJ/mol (simple calculation by NIST; no Washburn corrections); ALS |
Quantity | Value | Units | Method | Reference | Comment |
S°gas | 274.47 | J/mol*K | N/A | Furuyama S., 1970 | This a second law entropy value was obtained from study of gas-phase equilibrium. The value of S(298.2 K)=270.3(4.2) J/mol*K was obtained from other equilibrium study [ Grant C.J., 1969].; GT |
Constant pressure heat capacity of gas
Cp,gas (J/mol*K) | Temperature (K) | Reference | Comment |
---|---|---|---|
33.29 | 50. | Dorofeeva O.V., 1986 | Recommended S(T) values differ from other statistically calculated values [ Turnbull A.G., 1967, Furuyama S., 1970] up to 2.6 J/mol*K. Discrepancies in Cp(T) values amount to 1.3-4.3 J/mol*K. There is an excellent agreement between selected values of S(T) and Cp(T) and those obtained by ab initio calculation [ Karni M., 1991].; GT |
35.04 | 100. | ||
40.32 | 150. | ||
49.53 | 200. | ||
68.30 | 273.15 | ||
75.4 ± 2.0 | 298.15 | ||
75.89 | 300. | ||
103.30 | 400. | ||
126.45 | 500. | ||
145.03 | 600. | ||
160.04 | 700. | ||
172.41 | 800. | ||
182.77 | 900. | ||
191.55 | 1000. | ||
199.04 | 1100. | ||
205.47 | 1200. | ||
211.00 | 1300. | ||
215.77 | 1400. | ||
219.92 | 1500. |

Condensed phase thermochemistry data

Data compiled by: Eugene S. Domalski and Elizabeth D. Hearing
Quantity | Value | Units | Method | Reference | Comment |
---|---|---|---|---|---|
S°liquid | 182.7 | J/mol*K | N/A | Lebedev and Lityagov, 1977 |
Constant pressure heat capacity of liquid
Cp,liquid (J/mol*K) | Temperature (K) | Reference | Comment |
---|---|---|---|
115.3 | 298.15 | Lebedev and Lityagov, 1977 | T = 14 to 330 K. |

Phase change data

Data compiled as indicated in comments:
BS - Robert L. Brown and Stephen E. Stein
TRC - Thermodynamics Research Center, NIST Boulder Laboratories, Chris Muzny director
ALS - Hussein Y. Afeefy, Joel F. Liebman, and Stephen E. Stein
AC - William E. Acree, Jr., James S. Chickos
DH - Eugene S. Domalski and Elizabeth D. Hearing
Quantity | Value | Units | Method | Reference | Comment |
---|---|---|---|---|---|
Tboil | 314. ± 2. | K | AVG | N/A | Average of 8 values; Individual data points |
Quantity | Value | Units | Method | Reference | Comment |
Tfus | 183.15 | K | N/A | Murphy and Duggan, 1949 | Uncertainty assigned by TRC = 10. K; TRC |
Tfus | 188. | K | N/A | Staudinger, 1926 | Uncertainty assigned by TRC = 3. K; TRC |
Quantity | Value | Units | Method | Reference | Comment |
Ttriple | 176.60 | K | N/A | Lebedev and Lityagov, 1977, 2 | Uncertainty assigned by TRC = 0.05 K; TRC |
Quantity | Value | Units | Method | Reference | Comment |
ΔvapH° | 29. | kJ/mol | V | Rogers, 1972 | ALS |
ΔvapH° | 28.4 ± 0.3 | kJ/mol | V | Hull, Reid, et al., 1965 | ALS |
ΔvapH° | 28.4 ± 0.3 | kJ/mol | MM | Hull, Reid, et al., 1965, 2 | Based on data from 291. to 314. K.; AC |
ΔvapH° | 29.7 | kJ/mol | N/A | Hull, Reid, et al., 1965, 2 | Based on data from 273. to 287. K. See also Barrett and Burrage, 1932.; AC |
Enthalpy of vaporization
ΔvapH (kJ/mol) | Temperature (K) | Method | Reference | Comment |
---|---|---|---|---|
28.1 | 302. | A,MM | Stephenson and Malanowski, 1987 | Based on data from 291. to 314. K. See also Hull, Reid, et al., 1965, 2.; AC |
28.2 | 286. | N/A | Lesteva, Ogorodnikov, et al., 1967 | Based on data from 271. to 314. K. See also Boublik, Fried, et al., 1984.; AC |
Antoine Equation Parameters
log10(P) = A − (B / (T + C))
P = vapor pressure (bar)
T = temperature (K)
View plot Requires a JavaScript / HTML 5 canvas capable browser.
Temperature (K) | A | B | C | Reference | Comment |
---|---|---|---|---|---|
271.3 to 314. | 2.65373 | 531.826 | -113.863 | Lesteva, Ogoradnikov, et al., 1967 | Coefficents calculated by NIST from author's data. |
Enthalpy of fusion
ΔfusH (kJ/mol) | Temperature (K) | Reference | Comment |
---|---|---|---|
8.010 | 176.60 | Lebedev and Lityagov, 1977 | DH |
8.01 | 176.6 | Domalski and Hearing, 1996 | AC |
Entropy of fusion
ΔfusS (J/mol*K) | Temperature (K) | Reference | Comment |
---|---|---|---|
45.4 | 176.60 | Lebedev and Lityagov, 1977 | DH |

Reaction thermochemistry data

Data compiled as indicated in comments:
B - John E. Bartmess
M - Michael M. Meot-Ner (Mautner) and Sharon G. Lias
ALS - Hussein Y. Afeefy, Joel F. Liebman, and Stephen E. Stein
MS - José A. Martinho Simões
Individual Reactions
Quantity | Value | Units | Method | Reference | Comment |
---|---|---|---|---|---|
ΔrH° | 1481. ± 9.2 | kJ/mol | G+TS | Bartmess, Scott, et al., 1979 | gas phase; value altered from reference due to change in acidity scale; B |
ΔrH° | 1485. ± 12. | kJ/mol | G+TS | Cumming and Kebarle, 1978 | gas phase; B |
ΔrH° | 1495. ± 8.4 | kJ/mol | D-EA | Engelking and Lineberger, 1977 | gas phase; B |
Quantity | Value | Units | Method | Reference | Comment |
ΔrG° | 1455. ± 8.4 | kJ/mol | IMRE | Bartmess, Scott, et al., 1979 | gas phase; value altered from reference due to change in acidity scale; B |
ΔrG° | 1459. ± 8.4 | kJ/mol | IMRE | Cumming and Kebarle, 1978 | gas phase; B |
By formula: C5H5- + C5H6 = (C5H5- • C5H6)
Quantity | Value | Units | Method | Reference | Comment |
---|---|---|---|---|---|
ΔrH° | <36.0 | kJ/mol | IMRB | Meot-ner, 1988 | gas phase; B,M |
Quantity | Value | Units | Method | Reference | Comment |
ΔrS° | 84. | J/mol*K | N/A | Meot-ner, 1988 | gas phase; Entropy change calculated or estimated, DG<, ΔrH<; M |
Quantity | Value | Units | Method | Reference | Comment |
ΔrG° | <11. ± 4.2 | kJ/mol | IMRB | Meot-ner, 1988 | gas phase; B |
Free energy of reaction
ΔrG° (kJ/mol) | T (K) | Method | Reference | Comment |
---|---|---|---|---|
15. | 250. | PHPMS | Meot-ner, 1988 | gas phase; Entropy change calculated or estimated, DG<, ΔrH<; M |
By formula: C4H2O3 + C5H6 = C9H8O3
Quantity | Value | Units | Method | Reference | Comment |
---|---|---|---|---|---|
ΔrH° | -104. ± 2. | kJ/mol | Cm | Breslauer and Kabakoff, 1974 | liquid phase; solvent: Dioxane; ALS |
ΔrH° | -107.9 | kJ/mol | Cm | Rogers and Quan, 1973 | liquid phase; Gas phase Diels-Alder; ALS |
By formula: 2H2 + C5H6 = C5H10
Quantity | Value | Units | Method | Reference | Comment |
---|---|---|---|---|---|
ΔrH° | -210.8 ± 0.84 | kJ/mol | Chyd | Kistiakowsky, Ruhoff, et al., 1936 | gas phase; Reanalyzed by Cox and Pilcher, 1970, Original value = -212.8 ± 0.84 kJ/mol; At 355 °K; ALS |
By formula: Cl- + C5H6 = (Cl- • C5H6)
Quantity | Value | Units | Method | Reference | Comment |
---|---|---|---|---|---|
ΔrG° | <10.5 | kJ/mol | TDEq | French, Ikuta, et al., 1982 | gas phase; B |
Free energy of reaction
ΔrG° (kJ/mol) | T (K) | Method | Reference | Comment |
---|---|---|---|---|
10. | 300. | PHPMS | French, Ikuta, et al., 1982 | gas phase; DG<; M |
By formula: C5H6 + C6N4 = C11H6N4
Quantity | Value | Units | Method | Reference | Comment |
---|---|---|---|---|---|
ΔrH° | -112. | kJ/mol | Kin | Samuilov, Bukharov, et al., 1981 | liquid phase; solvent: Chorobenzene; ALS |
ΔrH° | -106.9 ± 2.9 | kJ/mol | Cm | Rogers, 1972 | liquid phase; ALS |
By formula: C7H8 = C5H6 + C2H2
Quantity | Value | Units | Method | Reference | Comment |
---|---|---|---|---|---|
ΔrH° | 117.2 ± 2.1 | kJ/mol | Kin | Walsh and Wells, 1975 | gas phase; Reanalyzed by Pedley, Naylor, et al., 1986, Original value = 118.7 ± 1.3 kJ/mol; ALS |
By formula: 2C5H6 (l) + Mg (cr) = C10H10Mg (cr) + H2 (g)
Quantity | Value | Units | Method | Reference | Comment |
---|---|---|---|---|---|
ΔrH° | -142.5 ± 2.9 | kJ/mol | RSC | Hull, Reid, et al., 1967 | Please also see Pedley and Rylance, 1977 and Cox and Pilcher, 1970, 2.; MS |
C8H6MoO3 (solution) + 3 (solution) = C18H15MoN3O3 (solution) +
(solution)
By formula: C8H6MoO3 (solution) + 3C4H4N2 (solution) = C18H15MoN3O3 (solution) + C5H6 (solution)
Quantity | Value | Units | Method | Reference | Comment |
---|---|---|---|---|---|
ΔrH° | -69.9 ± 2.9 | kJ/mol | RSC | Nolan, Hoff, et al., 1985 | solvent: Pyridine; Reaction temperature: 323 K; MS |
By formula: C5H6 = C5H6
Quantity | Value | Units | Method | Reference | Comment |
---|---|---|---|---|---|
ΔrH° | -200. ± 2. | kJ/mol | Ciso | Roth, Klarner, et al., 1980 | liquid phase; solvent: Heptane; ALS |
By formula: C10H12 = 2C5H6
Quantity | Value | Units | Method | Reference | Comment |
---|---|---|---|---|---|
ΔrH° | 72.383 | kJ/mol | Cm | Baur and Frater, 1941 | gas phase; Heat of dissociation; ALS |
By formula: 2HI + C5H6 = C5H8 + I2
Quantity | Value | Units | Method | Reference | Comment |
---|---|---|---|---|---|
ΔrH° | -89.5 | kJ/mol | Eqk | Furuyama, Golden, et al., 1970 | gas phase; ALS |
By formula: C7H10 = C5H6 + C2H4
Quantity | Value | Units | Method | Reference | Comment |
---|---|---|---|---|---|
ΔrH° | 97.2 ± 2.5 | kJ/mol | Eqk | Walsh and Wells, 1976 | gas phase; ALS |
By formula: C11H6N4 = C5H6 + C6N4
Quantity | Value | Units | Method | Reference | Comment |
---|---|---|---|---|---|
ΔrH° | 106.9 ± 2.9 | kJ/mol | Cm | Rogers, 1972 | solid phase; ALS |
By formula: C5H6 + C2H2 = C7H8
Quantity | Value | Units | Method | Reference | Comment |
---|---|---|---|---|---|
ΔrH° | -117. ± 2. | kJ/mol | Eqk | Walsh and Wells, 1975 | gas phase; ALS |
By formula: 2C5H6 = C10H12
Quantity | Value | Units | Method | Reference | Comment |
---|---|---|---|---|---|
ΔrH° | -195.1 | kJ/mol | Eqk | Lenz and Vaughan, 1989 | gas phase; ALS |
2 = C10H12
By formula: 2C5H6 = C10H12
Quantity | Value | Units | Method | Reference | Comment |
---|---|---|---|---|---|
ΔrH° | -195.7 | kJ/mol | Eqk | Lenz and Vaughan, 1989 | gas phase; ALS |

Gas phase ion energetics data

Data evaluated as indicated in comments:
HL - Edward P. Hunter and Sharon G. Lias
L - Sharon G. Lias
Data compiled as indicated in comments:
B - John E. Bartmess
MM - Michael M. Meot-Ner (Mautner)
LL - Sharon G. Lias and Joel F. Liebman
LLK - Sharon G. Lias, Rhoda D. Levin, and Sherif A. Kafafi
RDSH - Henry M. Rosenstock, Keith Draxl, Bruce W. Steiner, and John T. Herron
Quantity | Value | Units | Method | Reference | Comment |
---|---|---|---|---|---|
IE (evaluated) | 8.57 ± 0.01 | eV | N/A | N/A | L |
Quantity | Value | Units | Method | Reference | Comment |
Proton affinity (review) | 821.6 | kJ/mol | N/A | Hunter and Lias, 1998 | HL |
Quantity | Value | Units | Method | Reference | Comment |
Gas basicity | 798.4 | kJ/mol | N/A | Hunter and Lias, 1998 | HL |
Proton affinity at 298K
Proton affinity (kJ/mol) | Reference | Comment |
---|---|---|
828.0 | Aue, Guidoni, et al., 2000 | Experimental literature data re-evaluated by the authors using ab initio protonation entropies; MM |
Gas basicity at 298K
Gas basicity (review) (kJ/mol) | Reference | Comment |
---|---|---|
798.3 | Aue, Guidoni, et al., 2000 | Experimental literature data re-evaluated by the authors using ab initio protonation entropies; MM |
Ionization energy determinations
IE (eV) | Method | Reference | Comment |
---|---|---|---|
8.44 | PE | Kiselev, Sakhabutdinov, et al., 1992 | LL |
8.58 ± 0.02 | PE | Bieri, Burger, et al., 1977 | LLK |
8.56 ± 0.01 | EI | Holmes and McGillivray, 1971 | LLK |
8.57 ± 0.01 | PI | Derrick, Asbrink, et al., 1971 | LLK |
8.57 ± 0.01 | PI | Demeo and El-Sayed, 1970 | RDSH |
9.0 | EI | Hedaya, Kent, et al., 1968 | RDSH |
8.55 | PI | Dewar and Worley, 1968 | RDSH |
8.53 | PE | Kiselev, Sakhabutdinov, et al., 1992 | Vertical value; LL |
8.61 | PE | Bock and Kaim, 1980 | Vertical value; LLK |
8.6 | PE | Cradock, Ebsworth, et al., 1975 | Vertical value; LLK |
8.56 | PE | Cradock, Findlay, et al., 1974 | Vertical value; LLK |
Appearance energy determinations
Ion | AE (eV) | Other Products | Method | Reference | Comment |
---|---|---|---|---|---|
C5H5+ | 12.62 | H | EI | Occolowitz and White, 1968 | RDSH |
C5H5+ | 12.9 | H | EI | Harrison, Haynes, et al., 1965 | RDSH |
C5H5+ | 11.9 ± 0.5 | H | EI | Dorman, 1965 | RDSH |
C5H5+ | 12.6 | H | EI | Harrison, Honnen, et al., 1960 | RDSH |
De-protonation reactions
Quantity | Value | Units | Method | Reference | Comment |
---|---|---|---|---|---|
ΔrH° | 1481. ± 9.2 | kJ/mol | G+TS | Bartmess, Scott, et al., 1979 | gas phase; value altered from reference due to change in acidity scale; B |
ΔrH° | 1485. ± 12. | kJ/mol | G+TS | Cumming and Kebarle, 1978 | gas phase; B |
ΔrH° | 1495. ± 8.4 | kJ/mol | D-EA | Engelking and Lineberger, 1977 | gas phase; B |
Quantity | Value | Units | Method | Reference | Comment |
ΔrG° | 1455. ± 8.4 | kJ/mol | IMRE | Bartmess, Scott, et al., 1979 | gas phase; value altered from reference due to change in acidity scale; B |
ΔrG° | 1459. ± 8.4 | kJ/mol | IMRE | Cumming and Kebarle, 1978 | gas phase; B |

Ion clustering data

Data compiled as indicated in comments:
B - John E. Bartmess
M - Michael M. Meot-Ner (Mautner) and Sharon G. Lias
Clustering reactions
By formula: C5H5- + C5H6 = (C5H5- • C5H6)
Quantity | Value | Units | Method | Reference | Comment |
---|---|---|---|---|---|
ΔrH° | <36.0 | kJ/mol | IMRB | Meot-ner, 1988 | gas phase; B,M |
Quantity | Value | Units | Method | Reference | Comment |
ΔrS° | 84. | J/mol*K | N/A | Meot-ner, 1988 | gas phase; Entropy change calculated or estimated, DG<, ΔrH<; M |
Quantity | Value | Units | Method | Reference | Comment |
ΔrG° | <11. ± 4.2 | kJ/mol | IMRB | Meot-ner, 1988 | gas phase; B |
Free energy of reaction
ΔrG° (kJ/mol) | T (K) | Method | Reference | Comment |
---|---|---|---|---|
15. | 250. | PHPMS | Meot-ner, 1988 | gas phase; Entropy change calculated or estimated, DG<, ΔrH<; M |
By formula: Cl- + C5H6 = (Cl- • C5H6)
Quantity | Value | Units | Method | Reference | Comment |
---|---|---|---|---|---|
ΔrG° | <10.5 | kJ/mol | TDEq | French, Ikuta, et al., 1982 | gas phase; B |
Free energy of reaction
ΔrG° (kJ/mol) | T (K) | Method | Reference | Comment |
---|---|---|---|---|
10. | 300. | PHPMS | French, Ikuta, et al., 1982 | gas phase; DG<; M |

Kovats' RI, non-polar column, isothermal

Column type | Active phase | Temperature (C) | I | Reference | Comment |
---|---|---|---|---|---|
Capillary | OV-101 | 100. | 545. | Diez, Guillen, et al., 1990 | N2; Column length: 25. m; Column diameter: 0.23 mm |
Capillary | OV-101 | 80. | 542. | Diez, Guillen, et al., 1990 | N2; Column length: 25. m; Column diameter: 0.23 mm |
Capillary | Squalane | 100. | 534.7 | Diez, Guillen, et al., 1990 | N2; Column length: 45. m; Column diameter: 0.5 mm |
Capillary | Squalane | 80. | 510.5 | Diez, Guillen, et al., 1990 | N2; Column length: 45. m; Column diameter: 0.5 mm |
Capillary | SE-54 | 100. | 552.5 | Diez, Guillen, et al., 1990 | N2; Column length: 25. m; Column diameter: 0.22 mm |
Capillary | SE-54 | 80. | 549.5 | Diez, Guillen, et al., 1990 | N2; Column length: 25. m; Column diameter: 0.22 mm |
Packed | Squalane | 70. | 527. | Safina, Poznyak, et al., 1989 | He, Risorb (0.2-0.3 mm); Column length: 2. m |
Capillary | Squalane | 50. | 521.7 | Papazova, Milina, et al., 1988 | Column length: 50. m; Column diameter: 0.25 mm |
Capillary | BP-1 | 100. | 543. | Bermejo, Blanco, et al., 1987 | N2; Column length: 12. m; Column diameter: 0.22 mm |
Capillary | BP-1 | 80. | 541. | Bermejo, Blanco, et al., 1987 | N2; Column length: 12. m; Column diameter: 0.22 mm |
Capillary | OV-101 | 100. | 545. | Bermejo, Blanco, et al., 1987 | N2; Column length: 25. m; Column diameter: 0.23 mm |
Capillary | OV-101 | 80. | 542. | Bermejo, Blanco, et al., 1987 | N2; Column length: 25. m; Column diameter: 0.23 mm |
Capillary | Squalane | 64. | 523. | Sojak, Ruman, et al., 1987 | 50. m/0.25 mm/0.25 μm, H2 |
Capillary | SE-30 | 130. | 546. | Bredael, 1982 | Column length: 100. m; Column diameter: 0.5 mm |
Capillary | SE-30 | 80. | 540. | Bredael, 1982 | Column length: 100. m; Column diameter: 0.5 mm |
Capillary | Squalane | 50. | 521.8 | Bajus, Veselý, et al., 1979 | Column length: 100. m; Column diameter: 0.25 mm |
Capillary | Squalane | 50. | 521.6 | Bajus, Veselý, et al., 1979, 2 | Column length: 100. m; Column diameter: 0.25 mm |
Packed | Squalane | 27. | 518. | Bogoslovsky, Anvaer, et al., 1978 | |
Packed | Squalane | 49. | 521. | Bogoslovsky, Anvaer, et al., 1978 | |
Packed | Squalane | 67. | 527. | Bogoslovsky, Anvaer, et al., 1978 | |
Packed | Squalane | 86. | 530. | Bogoslovsky, Anvaer, et al., 1978 | |
Capillary | Squalane | 40. | 520.6 | Stopp, Engewald, et al., 1978 | Column length: 70. m; Column diameter: 0.23 mm |
Capillary | Squalane | 27. | 516.61 | Schomburg and Dielmann, 1973 | Column length: 100. m; Column diameter: 0.25 mm |
Packed | Squalane | 27. | 519. | Hively and Hinton, 1968 | He, Chromosorb P; Column length: 15. m; Column diameter: 0.25 mm |
Packed | Squalane | 49. | 522. | Hively and Hinton, 1968 | He, Chromosorb P; Column length: 15. m; Column diameter: 0.25 mm |
Packed | Squalane | 67. | 528. | Hively and Hinton, 1968 | He, Chromosorb P; Column length: 15. m; Column diameter: 0.25 mm |
Packed | Squalane | 86. | 530. | Hively and Hinton, 1968 | He, Chromosorb P; Column length: 15. m; Column diameter: 0.25 mm |

Kovats' RI, non-polar column, custom temperature program

Column type | Active phase | I | Reference | Comment |
---|---|---|---|---|
Capillary | Petrocol DH-100 | 538.1 | Haagen-Smit Laboratory, 1997 | He; Column length: 100. m; Column diameter: 0.2 mm; Program: 5C(10min) => 5C/min => 50C(48min) => 1.5C/min => 195C(91min) |
Capillary | DB-1 | 533. | Hoekman, 1993 | 60. m/0.32 mm/1.0 μm, He; Program: -40 C for 12 min; -40 - 125 C at 3 deg.min; 125-185 C at 6 deg/min; 185 - 220 C at 20 deg/min; hold 220 C for 2 min |

Kovats' RI, polar column, isothermal

Column type | Active phase | Temperature (C) | I | Reference | Comment |
---|---|---|---|---|---|
Capillary | Carbowax 20M | 64. | 745.7 | Sojak, Ruman, et al., 1987 | 50. m/0.25 mm/0.25 μm, H2 |

Kovats' RI, polar column, temperature ramp

Column type | Active phase | I | Reference | Comment |
---|---|---|---|---|
Capillary | DB-Wax | 735. | Umano and Shibamoto, 1987 | He, 40. C @ 10. min, 2. K/min; Column length: 60. m; Column diameter: 0.25 mm; Tend: 200. C |

Normal alkane RI, non-polar column, isothermal

Column type | Active phase | Temperature (C) | I | Reference | Comment |
---|---|---|---|---|---|
Capillary | Methyl Silicone | 50. | 522. | N/A | N2; Column length: 74.6 m; Column diameter: 0.28 mm |

Normal alkane RI, non-polar column, temperature ramp

Column type | Active phase | I | Reference | Comment |
---|---|---|---|---|
Capillary | Polydimethyl siloxane: CP-Sil 5 CB | 528. | Bramston-Cook, 2013 | 60. m/0.25 mm/1.0 μm, Helium, 45. C @ 1.45 min, 3.6 K/min, 210. C @ 2.72 min |
Capillary | PONA | 525. | Zhang, Ding, et al., 2009 | 50. m/0.20 mm/0.50 μm, Nitrogen, 35. C @ 15. min, 2. K/min, 200. C @ 10. min |

Normal alkane RI, non-polar column, custom temperature program

Column type | Active phase | I | Reference | Comment |
---|---|---|---|---|
Capillary | Squalane | 523. | Chen, 2008 | Program: not specified |
Capillary | PONA | 538. | Perkin Elmer Instruments, 2002 | Column length: 100. m; Phase thickness: 0.50 μm; Program: not specified |
Capillary | OV-101 | 530. | Zenkevich, 1998 | He; Column length: 25. m; Column diameter: 0.20 mm; Program: not specified |
Capillary | OV-101 | 535. | Zenkevich, 1998 | He; Column length: 25. m; Column diameter: 0.20 mm; Program: not specified |
Capillary | OV-1, SE-30, Methyl silicone, SP-2100, OV-101, DB-1, etc. | 540. | Waggott and Davies, 1984 | Hydrogen; Column length: 50. m; Column diameter: 0.32 mm; Program: not specified |

Lee's RI, non-polar column, temperature ramp

Column type | Active phase | I | Reference | Comment |
---|---|---|---|---|
Capillary | HP-5 | 97.2 | Shao, Wang, et al., 2006 | 30. m/0.3 mm/0.25 μm, He, 50. C @ 5. min, 5. K/min, 200. C @ 15. min |

References

Roth, Adamczak, et al., 1991
Roth, W.R.; Adamczak, O.; Breuckmann, R.; Lennartz, H.-W.; Boese, R.,
Die Berechnung von Resonanzenergien; das MM2ERW-Kraftfeld,
Chem. Ber., 1991, 124, 2499-2521. [all data]
Furuyama, Golden, et al., 1970
Furuyama, S.; Golden, D.M.; Benson, S.W.,
Thermochemistry of cyclopentene and cyclopentadiene from studies of gas-phase equilibria,
J. Chem. Thermodyn., 1970, 2, 161-169. [all data]
Wassermann, 1935
Wassermann, A.,
The mechanism of additions to double bonds. Part I. Thermochemistry and kinetics of a diene synthesis,
J. Chem. Soc., 1935, 828-838. [all data]
Furuyama S., 1970
Furuyama S.,
Thermochemistry of cyclopentene and cyclopentadiene from studies of gas-phase equilibria,
J. Chem. Thermodyn., 1970, 2, 161-169. [all data]
Grant C.J., 1969
Grant C.J.,
Reversibility in the gas-phase decomposition of cyclopentene. The entropy of cyclopentadiene,
J. Chem. Soc. Chem. Comm., 1969, 667-668. [all data]
Dorofeeva O.V., 1986
Dorofeeva O.V.,
Thermodynamic properties of twenty-one monocyclic hydrocarbons,
J. Phys. Chem. Ref. Data, 1986, 15, 437-464. [all data]
Turnbull A.G., 1967
Turnbull A.G.,
Thermochemistry of biscyclopentadienyl metal compounds,
Austral. J. Chem., 1967, 20, 2059-2067. [all data]
Karni M., 1991
Karni M.,
Ab initio calculations and ideal gas thermodynamic functions of cyclopentadiene and cyclopentadiene derivatives,
J. Phys. Chem. Ref. Data, 1991, 20, 665-683. [all data]
Lebedev and Lityagov, 1977
Lebedev, B.V.; Lityagov, V.Ya.,
Thermodynamics of polypentenamer synthesis reactions,
Vysokomol. Soedin., 1977, B19, 558-560. [all data]
Murphy and Duggan, 1949
Murphy, M.T.; Duggan, A.C.,
Pyrolysis of Butadiene,
J. Am. Chem. Soc., 1949, 71, 3347. [all data]
Staudinger, 1926
Staudinger, H.,
Ber. Dtsch. Chem. Ges., 1926, 59, 3019. [all data]
Lebedev and Lityagov, 1977, 2
Lebedev, B.V.; Lityagov, V.Ya.,
Thermodynamics of polypentenamer synthesis reactions crystalline polytetrahydrofuran at 0 K,
Vysokomol. Soedin., Ser. B, 1977, 19, 558. [all data]
Rogers, 1972
Rogers, F.E.,
Thermochemistry of the Diels-Alder reactions. II. Heat of addition of several dienes to tetracyanoethylene,
J. Phys. Chem., 1972, 76, 106-109. [all data]
Hull, Reid, et al., 1965
Hull, H.S.; Reid, A.F.; Turnbull, A.G.,
Vapour pressures of cyclopentadiene and bis(cyclopentadienyl)magnesium,
Aust. J. Chem., 1965, 18, 249. [all data]
Hull, Reid, et al., 1965, 2
Hull, HS; Reid, AF; Turnbull, AG,
Vapour pressures of cyclopentadiene and Bis(cyclopentadienyl)magnesium,
Aust. J. Chem., 1965, 18, 2, 249-621, https://doi.org/10.1071/CH9650249
. [all data]
Barrett and Burrage, 1932
Barrett, E.G.V.; Burrage, L.J.,
Some Observations on the Transformation of Cyclopentadiene into its Dimeride.,
J. Phys. Chem., 1932, 37, 8, 1029-1035, https://doi.org/10.1021/j150350a007
. [all data]
Stephenson and Malanowski, 1987
Stephenson, Richard M.; Malanowski, Stanislaw,
Handbook of the Thermodynamics of Organic Compounds, 1987, https://doi.org/10.1007/978-94-009-3173-2
. [all data]
Lesteva, Ogorodnikov, et al., 1967
Lesteva, T.M.; Ogorodnikov, S.K.; Morozova, A.I.,
Zh. Prikl. Khim. (Leningrad), 1967, 40, 4, 891. [all data]
Boublik, Fried, et al., 1984
Boublik, T.; Fried, V.; Hala, E.,
The Vapour Pressures of Pure Substances: Selected Values of the Temperature Dependence of the Vapour Pressures of Some Pure Substances in the Normal and Low Pressure Region, 2nd ed., Elsevier, New York, 1984, 972. [all data]
Lesteva, Ogoradnikov, et al., 1967
Lesteva, T.M.; Ogoradnikov, S.K.; Morozova, A.,
Kinetics of Dimerisation of Cyclopentadiene and Equilibrium of Liquid-Steam in System of Isoprene-Cyclopentadiene,
Zh. Prikl. Khim. (Leningrad), 1967, 40, 891-894. [all data]
Domalski and Hearing, 1996
Domalski, Eugene S.; Hearing, Elizabeth D.,
Heat Capacities and Entropies of Organic Compounds in the Condensed Phase. Volume III,
J. Phys. Chem. Ref. Data, 1996, 25, 1, 1, https://doi.org/10.1063/1.555985
. [all data]
Bartmess, Scott, et al., 1979
Bartmess, J.E.; Scott, J.A.; McIver, R.T., Jr.,
The gas phase acidity scale from methanol to phenol,
J. Am. Chem. Soc., 1979, 101, 6047. [all data]
Cumming and Kebarle, 1978
Cumming, J.B.; Kebarle, P.,
Summary of gas phase measurements involving acids AH. Entropy changes in proton transfer reactions involving negative ions. Bond dissociation energies D(A-H) and electron affinities EA(A),
Can. J. Chem., 1978, 56, 1. [all data]
Engelking and Lineberger, 1977
Engelking, P.C.; Lineberger, W.C.,
Laser photoelectron spectrometry of C5H5-: A determination of the electron affinity and Jahn-Teller coupling in cyclopentadienyl,
J. Chem. Phys., 1977, 67, 1412. [all data]
Meot-ner, 1988
Meot-ner, M.,
The Ionic Hydrogen Bond and Solvation. 7. Interaction Energies of Carbanions with Solvent Molecules,
J. Am. Chem. Soc., 1988, 110, 12, 3858, https://doi.org/10.1021/ja00220a022
. [all data]
Breslauer and Kabakoff, 1974
Breslauer, K.J.; Kabakoff, D.S.,
Enthalpy of the Diels-Alder reaction of cyclopentadiene and maleic anhydride,
J. Org. Chem., 1974, 39, 721-722. [all data]
Rogers and Quan, 1973
Rogers, F.E.; Quan, S.W.,
Thermochemistry of the Diels-Alder reaction. III. Heat of addition of cyclopentadience to maleic anhydride,
J. Phys. Chem., 1973, 77, 828-831. [all data]
Kistiakowsky, Ruhoff, et al., 1936
Kistiakowsky, G.B.; Ruhoff, J.R.; Smith, H.A.; Vaughan, W.E.,
Heats of organic reactions. IV. Hydrogenation of some dienes and of benzene,
J. Am. Chem. Soc., 1936, 58, 146-153. [all data]
Cox and Pilcher, 1970
Cox, J.D.; Pilcher, G.,
Thermochemistry of Organic and Organometallic Compounds, Academic Press, New York, 1970, 1-636. [all data]
French, Ikuta, et al., 1982
French, M.A.; Ikuta, S.; Kebarle, P.,
Hydrogen bonding of O-H and C-H hydrogen donors to Cl-. Results from mass spectrometric measurement of the ion-molecule equilibria RH + Cl- = RHCl-,
Can. J. Chem., 1982, 60, 1907. [all data]
Samuilov, Bukharov, et al., 1981
Samuilov, Ya.D.; Bukharov, S.V.; Konovalov, A.I.,
Reactivity of tetraphenylcyclopentadiene and tetracyclone in the Diels-Alder reaction with cyanoethylenes,
Zh. Org. Khim., 1981, 17, 2389-2393. [all data]
Walsh and Wells, 1975
Walsh, R.; Wells, J.M.,
The enthalpy of formation of bicyclo[2,2,1]hepta-2,5-diene. Thermodynamic functions of bicyclo[2,2,1]heptane and bicyclo[2,2,1]hepta-2,5-diene,
J. Chem. Thermodyn., 1975, 7, 149-154. [all data]
Pedley, Naylor, et al., 1986
Pedley, J.B.; Naylor, R.D.; Kirby, S.P.,
Thermochemical Data of Organic Compounds, Chapman and Hall, New York, 1986, 1-792. [all data]
Hull, Reid, et al., 1967
Hull, H.S.; Reid, A.F.; Turnbull, A.G.,
Inorg. Chem., 1967, 6, 805. [all data]
Pedley and Rylance, 1977
Pedley, J.B.; Rylance, J.,
Computer Analysed Thermochemical Data: Organic and Organometallic Compounds, University of Sussex, Brigton, 1977. [all data]
Cox and Pilcher, 1970, 2
Cox, J.D.; Pilcher, G.,
Thermochemistry of Organic and Organometallic Compounds
in Academic Press, New York, 1970. [all data]
Nolan, Hoff, et al., 1985
Nolan, S.P.; Hoff, C.D.; Landrum, J.T.,
J. Organometal. Chem., 1985, 282, 357. [all data]
Roth, Klarner, et al., 1980
Roth, W.R.; Klarner, F.-G.; Lennartz, H.-W.,
Heats of hydrogenation. II. Heat of hydrogenation of bicyclo[2.1.0]pent-2-ene, an antiaromatic system,
Chem. Ber., 1980, 113, 1806-1818. [all data]
Baur and Frater, 1941
Baur, E.; Frater, S.,
Kinetik der bildung und des zerfalls von dicyclopentadien,
Helv. Chim. Acta, 1941, 24, 768-783. [all data]
Walsh and Wells, 1976
Walsh, R.; Wells, J.M.,
The enthalpy of formation and thermodynamic functions of bicyclo[2,2,1]hept-2-ene,
J. Chem. Thermodyn., 1976, 8, 55-60. [all data]
Lenz and Vaughan, 1989
Lenz, T.G.; Vaughan, J.D.,
Employing force-field calculations to predict equilibrium constants and other thermodynamic properties for the dimerization of 1,3-cyclopentadiene,
J. Phys. Chem., 1989, 93, 1592-1596. [all data]
Hunter and Lias, 1998
Hunter, E.P.; Lias, S.G.,
Evaluated Gas Phase Basicities and Proton Affinities of Molecules: An Update,
J. Phys. Chem. Ref. Data, 1998, 27, 3, 413-656, https://doi.org/10.1063/1.556018
. [all data]
Aue, Guidoni, et al., 2000
Aue, D.H.; Guidoni, M.; Betowski, L.D.,
Ab initio calculated gas-phase basicities of polynuclear aromatic hydrocarbons,
Int. J. Mass Spectrom., 2000, 201, 283. [all data]
Kiselev, Sakhabutdinov, et al., 1992
Kiselev, V.D.; Sakhabutdinov, A.G.; Shakirov, I.M.; Zverev, V.V.; Konovalov, A.I.,
Bis reactants in Diels-Alder reactions. VII. Preparation and properties of polyadducts of reactions of bis(polymethylcyclopentadienes) and bis(maleimides),
Zh. Org. Khim., 1992, 28, 2244. [all data]
Bieri, Burger, et al., 1977
Bieri, G.; Burger, F.; Heilbronner, E.; Maier, J.P.,
Valence ionization enrgies of hydrocarbons,
Helv. Chim. Acta, 1977, 60, 2213. [all data]
Holmes and McGillivray, 1971
Holmes, J.L.; McGillivray, D.,
The mass spectra of isomeric hydrocarbons-I: Norbornene and nortricyclene; The mechanisms and energetics of their fragmentations,
Org. Mass Spectrom., 1971, 5, 1349. [all data]
Derrick, Asbrink, et al., 1971
Derrick, P.J.; Asbrink, L.; Edqvist, O.; Jonsson, B.-O.; Lindholm, E.,
Rydberg series in small molecules. XIII. Photoelectron spectroscopy and electronic structure of cyclopentadiene,
Intern. J. Mass Spectrom. Ion Phys., 1971, 6, 203. [all data]
Demeo and El-Sayed, 1970
Demeo, D.A.; El-Sayed, M.A.,
Ionization potential and structure of olefins,
J. Chem. Phys., 1970, 52, 2622. [all data]
Hedaya, Kent, et al., 1968
Hedaya, E.; Kent, M.E.; McNeil, D.W.; Lossing, F.P.; McAllister, T.,
The thermal rearrangement of phenylnitrene to cyanocyclopentadiene,
Tetrahedron Lett., 1968, 30, 3415. [all data]
Dewar and Worley, 1968
Dewar, M.J.S.; Worley, S.D.,
Ionization potential of cis-1,3-butadiene,
J. Chem. Phys., 1968, 49, 2454. [all data]
Bock and Kaim, 1980
Bock, H.; Kaim, W.,
Radical ions. 37. Ionization and one-electron oxidation of electron-rich silylalkyl olefins,
J. Am. Chem. Soc., 1980, 102, 4429. [all data]
Cradock, Ebsworth, et al., 1975
Cradock, S.; Ebsworth, E.A.V.; Moretto, H.; Rankin, D.W.H.,
Photoelectron spectra and fluxional behaviour in some σ-cyclopentadienes,
J. Chem. Soc. Dalton Trans., 1975, 390. [all data]
Cradock, Findlay, et al., 1974
Cradock, S.; Findlay, R.H.; Palmer, M.H.,
Bonding in methyl- and silyl-cyclopentadiene compounds: a study by photoelectron spectroscopy ab initio molecular-orbital calculations,
J. Chem. Soc. Dalton Trans., 1974, 1650. [all data]
Occolowitz and White, 1968
Occolowitz, J.L.; White, G.L.,
Energetic considerations in the assignment of some fragment ion structures,
Australian J. Chem., 1968, 21, 997. [all data]
Harrison, Haynes, et al., 1965
Harrison, A.G.; Haynes, P.; McLean, S.; Meyer, F.,
The mass spectra of methyl-substituted cyclopentadienes,
J. Am. Chem. Soc., 1965, 87, 5099. [all data]
Dorman, 1965
Dorman, F.H.,
Second differential ionization-efficiency curves for fragment ions by electron impact,
J. Chem. Phys., 1965, 43, 3507. [all data]
Harrison, Honnen, et al., 1960
Harrison, A.G.; Honnen, L.R.; Dauben, H.J., Jr.; Lossing, F.P.,
Free radicals by mass spectrometry. XX. Ionization potentials of cyclopentadienyl and cycloheptatrienyl radicals,
J. Am. Chem. Soc., 1960, 82, 5593. [all data]
Powell and Edson, 1948
Powell, J.S.; Edson, K.C.,
Anal. Chem., 1948, 20, 510. [all data]
Diez, Guillen, et al., 1990
Diez, M.A.; Guillen, M.D.; Blanco, C.G.; Bermejo, J.,
Chromatographic study of methylcyclopentadiene dimers and iso-dimers and determination of their boiling points,
J. Chromatogr., 1990, 508, 363-374, https://doi.org/10.1016/S0021-9673(00)91279-2
. [all data]
Safina, Poznyak, et al., 1989
Safina, L.R.; Poznyak, T.I.; Lisitsyn, D.M.; Kiseleva, E.V.; Kovalev, G.I.,
Selective gas-chromatographic determination of trace unsaturated and aromatic-hydrocarbons in complex-mixtures,
J. Appl. Chem. USSR (Engl. Transl.), 1989, 44, 5, 749-754. [all data]
Papazova, Milina, et al., 1988
Papazova, D.; Milina, R.; Dimov, N.,
Comparative evaluation of retention of hydrocarbons present in the C5-petroleum fraction of methylsilicone and squalane phases,
Chromatographia, 1988, 25, 3, 177-180, https://doi.org/10.1007/BF02316441
. [all data]
Bermejo, Blanco, et al., 1987
Bermejo, J.; Blanco, C.G.; Diez, M.A.; Guillén, M.D.,
Kováts retention indices of selected mono and polycyclic olefins,
J. Hi. Res. Chromatogr. Chromatogr. Comm., 1987, 10, 8, 461-463, https://doi.org/10.1002/jhrc.1240100809
. [all data]
Sojak, Ruman, et al., 1987
Sojak, L.; Ruman, J.; Janak, J.,
Characterization of Monoalkylcyclopentadiens by Retention-Structure Correlation in Capillary Gas Chromatography,
J. Chromatogr., 1987, 391, 79-87, https://doi.org/10.1016/S0021-9673(01)94306-7
. [all data]
Bredael, 1982
Bredael, P.,
Retention indices of hydrocarbons on SE-30,
J. Hi. Res. Chromatogr. Chromatogr. Comm., 1982, 5, 6, 325-328, https://doi.org/10.1002/jhrc.1240050610
. [all data]
Bajus, Veselý, et al., 1979
Bajus, M.; Veselý, V.; Leclercq, P.A.; Rijks, J.A.,
Steam cracking of hydrocarbons. 2. Pyrolysis of methylcyclohexane,
Ind. Eng. Chem. Prod. Res. Dev., 1979, 18, 2, 135-142, https://doi.org/10.1021/i360070a012
. [all data]
Bajus, Veselý, et al., 1979, 2
Bajus, M.; Veselý, V.; Leclercq, P.A.; Rijks, J.A.,
Steam cracking of hydrocarbons. 1. Pyrolysis of heptane,
Ind. Eng. Chem. Prod. Res. Dev., 1979, 18, 1, 30-37, https://doi.org/10.1021/i360069a007
. [all data]
Bogoslovsky, Anvaer, et al., 1978
Bogoslovsky, Yu.N.; Anvaer, B.I.; Vigdergauz, M.S.,
Chromatographic constants in gas chromatography (in Russian), Standards Publ. House, Moscow, 1978, 192. [all data]
Stopp, Engewald, et al., 1978
Stopp, I.; Engewald, W.; Kühn, H.; Welsch, Th.,
Molekülstruktur und retentionsverhalten. VIII. Zum gaschromatographischen retentionsverhalten von dicyclopentadienderivaten,
J. Chromatogr., 1978, 147, 21-30, https://doi.org/10.1016/S0021-9673(00)85113-4
. [all data]
Schomburg and Dielmann, 1973
Schomburg, G.; Dielmann, G.,
Identification by means of retention parameters,
J. Chromatogr. Sci., 1973, 11, 3, 151-159, https://doi.org/10.1093/chromsci/11.3.151
. [all data]
Hively and Hinton, 1968
Hively, R.A.; Hinton, R.E.,
Variation of the retention index with temperature on squalane substrates,
J. Gas Chromatogr., 1968, 6, 4, 203-217, https://doi.org/10.1093/chromsci/6.4.203
. [all data]
Haagen-Smit Laboratory, 1997
Haagen-Smit Laboratory,
Procedure for the detailed hydrocarbon analysis of gasolines by single column high efficiency (capillary) column gas chromatography, SOP NO. MLD 118, Revision No. 1.1, California Environmental Protection Agency, Air Resources Board, El Monte, California, 1997, 22. [all data]
Hoekman, 1993
Hoekman, S.K.,
Improved gas chromatography procedure for speciated hydrocarbon measurements of vehicle emissions,
J. Chromatogr., 1993, 639, 2, 239-253, https://doi.org/10.1016/0021-9673(93)80260-F
. [all data]
Umano and Shibamoto, 1987
Umano, K.; Shibamoto, T.,
Analysis of headspace volatiles from overheated beef fat,
J. Agric. Food Chem., 1987, 35, 1, 14-18, https://doi.org/10.1021/jf00073a004
. [all data]
Bramston-Cook, 2013
Bramston-Cook, R.,
Kovats indices for C2-C13 hydrocarbons and selected oxygenated/halocarbons with 100 % dimethylpolysiloxane columns, 2013, retrieved from http://lotusinstruments.com/monographs/List .... [all data]
Zhang, Ding, et al., 2009
Zhang, X.; Ding, L.; Sun, Z.; Song, L.; Sun, T.,
Study on quantitative structure-retention relationships for hydrocarbons in FCC gasoline,
Chromatographia, 2009, 70, 3/4, 511-518, https://doi.org/10.1365/s10337-009-1174-0
. [all data]
Chen, 2008
Chen, H.-F.,
Quantitative prediction of gas chromatography retention indices with support vector machines, radial basis neutral networks and multiple linear regression,
Anal. Chim. Acta, 2008, 609, 1, 24-36, https://doi.org/10.1016/j.aca.2008.01.003
. [all data]
Perkin Elmer Instruments, 2002
Perkin Elmer Instruments,
Detailed hydrocarbon analysis (DHAX) Model 4015, 2002, retrieved from http://www.perkinelmer.com/instruments. [all data]
Zenkevich, 1998
Zenkevich, I.G.,
Application of Methods of Molecular Dynamics in Chromato-Spectral Identification of ISomeric Products of Organic reactions (in Russian),
Zh. Org. Khim., 1998, 34, 10, 1463-1470. [all data]
Waggott and Davies, 1984
Waggott, A.; Davies, I.W.,
Identification of organic pollutants using linear temperature programmed retention indices (LTPRIs) - Part II, 1984, retrieved from http://dwi.defra.gov.uk/research/completed-research/reports/dwi0383.pdf. [all data]
Shao, Wang, et al., 2006
Shao, X.; Wang, G.; Sun, Y.; Zhang, R.; Xie, K.; Liu, H.,
Determination and Characterization of the Pyrolysis Products of Isoprocarb by GC-MS,
J. Chromatogr. Sci., 2006, 44, 3, 141-147, https://doi.org/10.1093/chromsci/44.3.141
. [all data]