Diethylsilane
- Formula: C4H12Si
- Molecular weight: 88.2236
- IUPAC Standard InChIKey: UCXUKTLCVSGCNR-UHFFFAOYSA-N
- CAS Registry Number: 542-91-6
- Chemical structure:
View 3d structure (requires JavaScript / HTML 5) - Other names: (C2H5)2SiH2; Silane, diethyl-

Phase change data

Data compiled by: Robert L. Brown and Stephen E. Stein
Quantity | Value | Units | Method | Reference | Comment |
---|---|---|---|---|---|
Tboil | 329. | K | N/A | PCR Inc., 1990 |

Reaction thermochemistry data

Data compiled by: John E. Bartmess
Individual Reactions
By formula: H- + C4H12Si = (H- • C4H12Si)
Quantity | Value | Units | Method | Reference | Comment |
---|---|---|---|---|---|
ΔrH° | 84. ± 17. | kJ/mol | IMRB | Hajdasz, Ho, et al., 1994 | gas phase; Hydride affinity order: Et3SiH≤Et2SiH2≤nPnSiH3≤SiH4. dHf(Et2SiH2) in 77Ped/Ryl is 10 kcal/mol too negative, relative to Me2SiH2.Group Additivity imples ca. -25 kcal/mol. |

Gas phase ion energetics data

Data compiled as indicated in comments:
LLK - Sharon G. Lias, Rhoda D. Levin, and Sherif A. Kafafi
Ionization energy determinations
IE (eV) | Method | Reference | Comment |
---|---|---|---|
9.8 | PE | Potzinger, Ritter, et al., 1975 | LLK |
10.3 | PE | Roberge, Sandorfy, et al., 1978 | Vertical value; LLK |
Appearance energy determinations
Ion | AE (eV) | Other Products | Method | Reference | Comment |
---|---|---|---|---|---|
C4H10Si+ | 10.0 ± 0.1 | H2 | EI | Potzinger, Ritter, et al., 1975 | LLK |

Ion clustering data

Data compiled by: John E. Bartmess
Clustering reactions
By formula: H- + C4H12Si = (H- • C4H12Si)
Quantity | Value | Units | Method | Reference | Comment |
---|---|---|---|---|---|
ΔrH° | 84. ± 17. | kJ/mol | IMRB | Hajdasz, Ho, et al., 1994 | gas phase; Hydride affinity order: Et3SiH≤Et2SiH2≤nPnSiH3≤SiH4. dHf(Et2SiH2) in 77Ped/Ryl is 10 kcal/mol too negative, relative to Me2SiH2.Group Additivity imples ca. -25 kcal/mol. |

References

PCR Inc., 1990
PCR Inc.,
Research Chemicals Catalog 1990-1991, PCR Inc., Gainesville, FL, 1990, 1. [all data]
Hajdasz, Ho, et al., 1994
Hajdasz, D.J.; Ho, Y.; Squires, R.R.,
Gas-Phase Chemistry of Pentacoordinate Silicon Hydrides,
J. Am. Chem. Soc., 1994, 116, 23, 10751, https://doi.org/10.1021/ja00102a045
. [all data]
Potzinger, Ritter, et al., 1975
Potzinger, P.; Ritter, A.; Krause, J.,
Massenspektrometrische Bestimmung von Bindungsenergien in siliciumorganischen Verbindungen,
Z. Naturforsch. A:, 1975, 30, 347. [all data]
Roberge, Sandorfy, et al., 1978
Roberge, R.; Sandorfy, C.; Matthews, J.I.; Strausz, O.P.,
The far ultraviolet HeI photoelectron spectra of alkyl and fluorine substituted silane derivatives,
J. Chem. Phys., 1978, 69, 5105. [all data]