Ethane, isothiocyanato-
- Formula: C3H5NS
- Molecular weight: 87.143
- IUPAC Standard InChIKey: HBNYJWAFDZLWRS-UHFFFAOYSA-N
- CAS Registry Number: 542-85-8
- Chemical structure:
View 3d structure (requires JavaScript / HTML 5) - Other names: Isothiocyanic acid, ethyl ester; Ethyl isothiocyanate; Ethyl mustard oil; Isothiocyanatoethane

Condensed phase thermochemistry data

Data compiled by: Eugene S. Domalski and Elizabeth D. Hearing
Constant pressure heat capacity of liquid
Cp,liquid (J/mol*K) | Temperature (K) | Reference |
---|---|---|
106.3 | 290. | Kurnakov and Voskresenskaya, 1936 |

Phase change data

Data compiled as indicated in comments:
AC - William E. Acree, Jr., James S. Chickos
Quantity | Value | Units | Method | Reference | Comment |
---|---|---|---|---|---|
ΔvapH° | 39.8 | kJ/mol | N/A | Bauer and Burschkies, 2006 | Based on data from 283. to 323. K. See also Boublik, Fried, et al., 1984.; AC |
ΔvapH° | 40.2 | kJ/mol | A | Stephenson and Malanowski, 1987 | Based on data from 283. to 404. K.; AC |
Antoine Equation Parameters
log10(P) = A − (B / (T + C))
P = vapor pressure (bar)
T = temperature (K)
View plot Requires a JavaScript / HTML 5 canvas capable browser.
Temperature (K) | A | B | C | Reference | Comment |
---|---|---|---|---|---|
283. to 323. | 3.96335 | 1431.598 | -50.463 | Bauer and Burschkies, 1935 | Coefficents calculated by NIST from author's data. |

Gas phase ion energetics data

Data compiled as indicated in comments:
LLK - Sharon G. Lias, Rhoda D. Levin, and Sherif A. Kafafi
RDSH - Henry M. Rosenstock, Keith Draxl, Bruce W. Steiner, and John T. Herron
Ionization energy determinations
IE (eV) | Method | Reference | Comment |
---|---|---|---|
9.14 ± 0.03 | PI | Watanabe, Nakayama, et al., 1962 | RDSH |
9.10 ± 0.15 | EI | Shenkel, Hobrock, et al., 1962 | RDSH |
9.12 ± 0.05 | PE | Neijzen and DeLange, 1980 | Vertical value; LLK |
Appearance energy determinations
Ion | AE (eV) | Other Products | Method | Reference | Comment |
---|---|---|---|---|---|
CHNS+ | 11.38 ± 0.15 | C2H4 | EI | Shenkel, Hobrock, et al., 1962 | RDSH |
CHS+ | 15.2 ± 0.5 | ? | EI | Hobrock, Shenkel, et al., 1963 | RDSH |
CH2NS+ | 12.0 ± 0.3 | ? | EI | Hobrock, Shenkel, et al., 1963 | RDSH |
CH3+ | 19.6 ± 0.5 | ? | EI | Hobrock, Shenkel, et al., 1963 | RDSH |
CNS+ | 14.6 ± 0.4 | ? | EI | Hobrock, Shenkel, et al., 1963 | RDSH |
CS+ | 16.1 ± 0.5 | ? | EI | Hobrock, Shenkel, et al., 1963 | RDSH |
C2HNS+ | 14.0 ± 0.2 | ? | EI | Hobrock, Shenkel, et al., 1963 | RDSH |
C2H2+ | 18.1 ± 0.2 | ? | EI | Hobrock, Shenkel, et al., 1963 | RDSH |
C2H2NS+ | 12.5 ± 0.2 | CH3 | EI | Hobrock, Shenkel, et al., 1963 | RDSH |
C2H3+ | 15.6 ± 0.3 | ? | EI | Hobrock, Shenkel, et al., 1963 | RDSH |
C2H5+ | 12.9 ± 0.2 | ? | EI | Hobrock, Shenkel, et al., 1963 | RDSH |
C2NS+ | 16.3 ± 0.2 | ? | EI | Hobrock, Shenkel, et al., 1963 | RDSH |

Kovats' RI, non-polar column, isothermal

Column type | Active phase | Temperature (C) | I | Reference | Comment |
---|---|---|---|---|---|
Packed | UCW-98 | 120. | 786.2 | Rajniaková and Floch, 1993 | N2, Chromosorb WAW DNCS; Column length: 1.8 m |

References

Kurnakov and Voskresenskaya, 1936
Kurnakov, N.S.; Voskresenskaya, N.K.,
Calorimetry of liquid binary systems, Izv. Akad. Nauk SSSR,
Otdel. Mat. i Estestv. Nauk. Ser. Khim, 1936, 1936, 439-461. [all data]
Bauer and Burschkies, 2006
Bauer, Hugo; Burschkies, Karl,
Sättigungsdrucke einiger Senföle und Sulfide,
Ber. dtsch. Chem. Ges. A/B, 2006, 68, 6, 1238-1243, https://doi.org/10.1002/cber.19350680645
. [all data]
Boublik, Fried, et al., 1984
Boublik, T.; Fried, V.; Hala, E.,
The Vapour Pressures of Pure Substances: Selected Values of the Temperature Dependence of the Vapour Pressures of Some Pure Substances in the Normal and Low Pressure Region, 2nd ed., Elsevier, New York, 1984, 972. [all data]
Stephenson and Malanowski, 1987
Stephenson, Richard M.; Malanowski, Stanislaw,
Handbook of the Thermodynamics of Organic Compounds, 1987, https://doi.org/10.1007/978-94-009-3173-2
. [all data]
Bauer and Burschkies, 1935
Bauer, H.; Burschkies, K.,
Sattigungsdrucke einiger Senfole und Sulfide,
Ber. Dtsch. Chem. Ges., 1935, 68, 6, 1238-1243, https://doi.org/10.1002/cber.19350680645
. [all data]
Watanabe, Nakayama, et al., 1962
Watanabe, K.; Nakayama, T.; Mottl, J.,
Ionization potentials of some molecules,
J. Quant. Spectry. Radiative Transfer, 1962, 2, 369. [all data]
Shenkel, Hobrock, et al., 1962
Shenkel, R.C.; Hobrock, B.G.; Kiser, R.W.,
The ionization potential of (iso)thiocyanic acid,
J. Phys. Chem., 1962, 66, 2074. [all data]
Neijzen and DeLange, 1980
Neijzen, B.J.M.; DeLange, C.A.,
Photoelectron spectroscopy of some thiocyanates, isocyanates and isothiocyanates,
J. Electron Spectrosc. Relat. Phenom., 1980, 18, 179. [all data]
Hobrock, Shenkel, et al., 1963
Hobrock, B.G.; Shenkel, R.C.; Kiser, R.W.,
Singly and doubly-charged ions from methyl and ethyl isothiocyanates by electron impact,
J. Phys. Chem., 1963, 67, 1684. [all data]