Methanethione, 2,4-cyclopentadien-1-ylidene-
- Formula: C6H4S
- Molecular weight: 108.161
- IUPAC Standard InChIKey: GCKOJJZSRSBUCP-UHFFFAOYSA-N
- CAS Registry Number: 54191-78-5
- Chemical structure:
View 3d structure (requires JavaScript / HTML 5) - Permanent link for this species. Use this link for bookmarking this species for future reference.

Gas phase ion energetics data

Data compiled by: Sharon G. Lias, Rhoda D. Levin, and Sherif A. Kafafi
Ionization energy determinations
IE (eV) | Method | Reference | Comment |
---|---|---|---|
8.0 | PE | Schulz and Schweig, 1979 | |
8.52 | PE | Schulz and Schweig, 1979 | Vertical value |

References

Schulz and Schweig, 1979
Schulz, R.; Schweig, A.,
Elucidation of thermal reactions by variable temperature photoelectron spectral detection of reactive intermediates. The UV photoelectron spectra of transient fulveneketene, fulvenethioketene, a ketoketene, and thiobenzpropiolactone,
Tetrahedron Lett., 1979, 59. [all data]