1,3-Dioxepin, 4,7-dihydro-
- Formula: C5H8O2
- Molecular weight: 100.1158
- IUPAC Standard InChIKey: BAKUAUDFCNFLBX-UHFFFAOYSA-N
- CAS Registry Number: 5417-32-3
- Chemical structure:
View 3d structure (requires JavaScript / HTML 5) - Other names: 4,7-Dihydro-1,3-dioxepin

Gas phase thermochemistry data

Data compiled by: Glushko Thermocenter, Russian Academy of Sciences, Moscow
Constant pressure heat capacity of gas
Cp,gas (cal/mol*K) | Temperature (K) | Reference | Comment |
---|---|---|---|
9.928 | 50. | Dorofeeva O.V., 1992 | p=1 bar. |
13.99 | 100. | ||
17.47 | 150. | ||
20.79 | 200. | ||
26.171 | 273.15 | ||
28.1 ± 1.2 | 298.15 | ||
28.272 | 300. | ||
36.054 | 400. | ||
42.990 | 500. | ||
48.812 | 600. | ||
53.652 | 700. | ||
57.703 | 800. | ||
61.123 | 900. | ||
64.025 | 1000. | ||
66.496 | 1100. | ||
68.611 | 1200. | ||
70.428 | 1300. | ||
71.989 | 1400. | ||
73.341 | 1500. |

Phase change data

Data compiled by: Robert L. Brown and Stephen E. Stein
Quantity | Value | Units | Method | Reference | Comment |
---|---|---|---|---|---|
Tboil | 399.2 | K | N/A | Aldrich Chemical Company Inc., 1990 |

Gas phase ion energetics data

Data compiled as indicated in comments:
LBLHLM - Sharon G. Lias, John E. Bartmess, Joel F. Liebman, John L. Holmes, Rhoda D. Levin, and W. Gary Mallard
Ionization energy determinations
IE (eV) | Method | Reference | Comment |
---|---|---|---|
9.0 | PE | Zverev, Villem, et al., 1982 | LBLHLM |
9.54 | PE | Zverev, Villem, et al., 1982 | Vertical value; LBLHLM |

References

Dorofeeva O.V., 1992
Dorofeeva O.V.,
Ideal gas thermodynamic properties of oxygen heterocyclic compounds. Part 2. Six-membered, seven-membered and eight-membered rings,
Thermochim. Acta, 1992, 200, 121-150. [all data]
Aldrich Chemical Company Inc., 1990
Aldrich Chemical Company Inc.,
Catalog Handbook of Fine Chemicals, Aldrich Chemical Company, Inc., Milwaukee WI, 1990, 1. [all data]
Zverev, Villem, et al., 1982
Zverev, V.V.; Villem, Ya.Ya.; Villem, N.V.; Klimovitskii, E.N.; Arbuzov, B.A.,
Photoelectron spectra and intramolecular interactions of dimethoxymethane and 4,7-dihydro-1,3-dioxepin,
J. Gen. Chem. USSR, 1982, 52, 1674, In original 1888. [all data]