Benzene, 1,3-dichloro-
- Formula: C6H4Cl2
- Molecular weight: 147.002
- IUPAC Standard InChIKey: ZPQOPVIELGIULI-UHFFFAOYSA-N
- CAS Registry Number: 541-73-1
- Chemical structure:
View 3d structure (requires JavaScript / HTML 5) - Other names: Benzene, m-dichloro-; m-Dichlorobenzene; m-Dichlorobenzol; m-Phenylene dichloride; 1,3-Dichlorobenzene; Metadichlorobenzene; Rcra waste number U071

Reaction thermochemistry data

Data compiled as indicated in comments:
B - John E. Bartmess
ALS - Hussein Y. Afeefy, Joel F. Liebman, and Stephen E. Stein
Individual Reactions
C6H3Cl2- + =
By formula: C6H3Cl2- + H+ = C6H4Cl2
Quantity | Value | Units | Method | Reference | Comment |
---|---|---|---|---|---|
ΔrH° | 1565. ± 8.8 | kJ/mol | G+TS | Schlosser, Marzi, et al., 2001 | gas phase; Acid: m-dichlorobenzene. Anion assigned based on ab initio calculations.; B |
Quantity | Value | Units | Method | Reference | Comment |
ΔrG° | 1533. ± 8.4 | kJ/mol | IMRE | Schlosser, Marzi, et al., 2001 | gas phase; Acid: m-dichlorobenzene. Anion assigned based on ab initio calculations.; B |
By formula: C6H4Cl2 = C6H4Cl2
Quantity | Value | Units | Method | Reference | Comment |
---|---|---|---|---|---|
ΔrH° | 4.0 | kJ/mol | Eqk | Godnev and Sverdlin, 1961 | gas phase; Correction of 56GOD/SVE; ALS |

Henry's Law data

Data compiled by: Rolf Sander
Henry's Law constant (water solution)
kH(T) = k°H exp(d(ln(kH))/d(1/T) ((1/T) - 1/(298.15 K)))
k°H = Henry's law constant for solubility in water at 298.15 K (mol/(kg*bar))
d(ln(kH))/d(1/T) = Temperature dependence constant (K)
k°H (mol/(kg*bar)) | d(ln(kH))/d(1/T) (K) | Method | Reference | Comment |
---|---|---|---|---|
0.34 | M | N/A | ||
0.30 | Q | N/A | missing citation give several references for the Henry's law constants but don't assign them to specific species. | |
0.30 | 2600. | X | N/A | |
0.39 | 2400. | X | N/A | |
0.28 | L | N/A | ||
0.21 | V | N/A |

Gas phase ion energetics data

Data evaluated as indicated in comments:
L - Sharon G. Lias
Data compiled as indicated in comments:
B - John E. Bartmess
LL - Sharon G. Lias and Joel F. Liebman
LBLHLM - Sharon G. Lias, John E. Bartmess, Joel F. Liebman, John L. Holmes, Rhoda D. Levin, and W. Gary Mallard
LLK - Sharon G. Lias, Rhoda D. Levin, and Sherif A. Kafafi
RDSH - Henry M. Rosenstock, Keith Draxl, Bruce W. Steiner, and John T. Herron
Quantity | Value | Units | Method | Reference | Comment |
---|---|---|---|---|---|
IE (evaluated) | 9.10 ± 0.02 | eV | N/A | N/A | L |
Quantity | Value | Units | Method | Reference | Comment |
ΔfH°(+) ion | 903.3 | kJ/mol | N/A | N/A | |
Quantity | Value | Units | Method | Reference | Comment |
ΔfH(+) ion,0K | 915.9 | kJ/mol | N/A | N/A |
Ionization energy determinations
IE (eV) | Method | Reference | Comment |
---|---|---|---|
9.10 ± 0.02 | PIPECO | Olesik, Baer, et al., 1986 | LBLHLM |
9.14 ± 0.03 | PE | Ruscic, Klasinc, et al., 1981 | LLK |
9.26 | PE | Kimura, Katsumata, et al., 1981 | LLK |
9.12 ± 0.02 | PE | Maier and Marthaler, 1978 | LLK |
9.11 ± 0.01 | EQ | Lias and Ausloos, 1978 | LLK |
9.12 ± 0.01 | PI | Watanabe, Nakayama, et al., 1962 | RDSH |
9.28 | PE | Fujisawa, Oonishi, et al., 1991 | Vertical value; LL |
9.15 | PE | Streets and Ceasar, 1973 | Vertical value; LLK |
Appearance energy determinations
Ion | AE (eV) | Other Products | Method | Reference | Comment |
---|---|---|---|---|---|
C6H4Cl+ | 13.3 ± 0.1 | Cl | EI | Brown, 1970 | RDSH |
De-protonation reactions
C6H3Cl2- + =
By formula: C6H3Cl2- + H+ = C6H4Cl2
Quantity | Value | Units | Method | Reference | Comment |
---|---|---|---|---|---|
ΔrH° | 1565. ± 8.8 | kJ/mol | G+TS | Schlosser, Marzi, et al., 2001 | gas phase; Acid: m-dichlorobenzene. Anion assigned based on ab initio calculations.; B |
Quantity | Value | Units | Method | Reference | Comment |
ΔrG° | 1533. ± 8.4 | kJ/mol | IMRE | Schlosser, Marzi, et al., 2001 | gas phase; Acid: m-dichlorobenzene. Anion assigned based on ab initio calculations.; B |

Gas phase thermochemistry data

Data compiled by: Hussein Y. Afeefy, Joel F. Liebman, and Stephen E. Stein
Quantity | Value | Units | Method | Reference | Comment |
---|---|---|---|---|---|
ΔfH°gas | 6.72 | kcal/mol | Ccr | Platonov and Simulin, 1984 |

Condensed phase thermochemistry data

Data compiled as indicated in comments:
ALS - Hussein Y. Afeefy, Joel F. Liebman, and Stephen E. Stein
DH - Eugene S. Domalski and Elizabeth D. Hearing
Quantity | Value | Units | Method | Reference | Comment |
---|---|---|---|---|---|
ΔfH°liquid | -4.89 ± 0.23 | kcal/mol | Ccb | Hubbard, Knowlton, et al., 1954 | ALS |
Quantity | Value | Units | Method | Reference | Comment |
ΔcH°liquid | -707.53 | kcal/mol | Ccr | Platonov and Simulin, 1984 | ALS |
ΔcH°liquid | -706.44 ± 0.23 | kcal/mol | Ccb | Hubbard, Knowlton, et al., 1954 | ALS |
ΔcH°liquid | -706. ± 2. | kcal/mol | Ccb | Smith, Bjellerup, et al., 1953 | ALS |
Constant pressure heat capacity of liquid
Cp,liquid (cal/mol*K) | Temperature (K) | Reference | Comment |
---|---|---|---|
40.85 | 298.15 | Narbutt, 1918 | T = 197 to 377 K. Cp = 0.27022 + 0.0003024t cal/g*K. Cp value calculated from equation.; DH |

Phase change data

Data compiled as indicated in comments:
BS - Robert L. Brown and Stephen E. Stein
TRC - Thermodynamics Research Center, NIST Boulder Laboratories, Chris Muzny director
AC - William E. Acree, Jr., James S. Chickos
DH - Eugene S. Domalski and Elizabeth D. Hearing
Quantity | Value | Units | Method | Reference | Comment |
---|---|---|---|---|---|
Tboil | 446.2 | K | N/A | Weast and Grasselli, 1989 | BS |
Tboil | 446.15 | K | N/A | Dreisbach and Martin, 1949 | Uncertainty assigned by TRC = 0.07 K; TRC |
Quantity | Value | Units | Method | Reference | Comment |
Tfus | 248.39 | K | N/A | Dreisbach and Martin, 1949 | Uncertainty assigned by TRC = 0.05 K; TRC |
Tfus | 249. | K | N/A | Timmermans, 1935 | Uncertainty assigned by TRC = 2. K; TRC |
Tfus | 246.9 | K | N/A | Timmermans, 1921 | Uncertainty assigned by TRC = 0.2 K; TRC |
Tfus | 248.75 | K | N/A | Narbutt, 1918, 2 | Uncertainty assigned by TRC = 0.5 K; TRC |
Quantity | Value | Units | Method | Reference | Comment |
ΔvapH° | 12.9 | kcal/mol | GC | Spieksma, Luijk, et al., 1994 | Based on data from 413. to 453. K.; AC |
ΔvapH° | 11.2 | kcal/mol | N/A | Boublik, Fried, et al., 1984 | Based on data from 360. to 450. K. See also Basarová and Svoboda, 1991.; AC |
Enthalpy of vaporization
ΔvapH (kcal/mol) | Temperature (K) | Method | Reference | Comment |
---|---|---|---|---|
12.0 | 248. | N/A | Rohác, Ruzicka, et al., 1999 | AC |
10.5 | 372. | EB | Rohác, Ruzicka, et al., 1998 | Based on data from 357. to 448. K.; AC |
12.0 | 262. | N/A | Polednicek, Guetachew, et al., 1996 | Based on data from 250. to 274. K.; AC |
10.7 | 363. | A | Stephenson and Malanowski, 1987 | Based on data from 348. to 513. K. See also Dykyj, 1972.; AC |
Antoine Equation Parameters
log10(P) = A − (B / (T + C))
P = vapor pressure (atm)
T = temperature (K)
View plot Requires a JavaScript / HTML 5 canvas capable browser.
Temperature (K) | A | B | C | Reference | Comment |
---|---|---|---|---|---|
363.87 to 446. | 4.19183 | 1629.812 | -57.328 | Dreisbach and Shrader, 1949 | Coefficents calculated by NIST from author's data. |
Enthalpy of fusion
ΔfusH (kcal/mol) | Temperature (K) | Method | Reference | Comment |
---|---|---|---|---|
3.01 | 248.3 | DSC | Wei and Jin, 2009 | See also Wei, 2008.; AC |
3.021 | 248.4 | N/A | Acree, 1991 | AC |
3.0091 | 248.75 | N/A | Narbutt, 1918 | DH |
Entropy of fusion
ΔfusS (cal/mol*K) | Temperature (K) | Reference | Comment |
---|---|---|---|
12.1 | 248.75 | Narbutt, 1918 | DH |

Kovats' RI, non-polar column, isothermal

Column type | Active phase | Temperature (C) | I | Reference | Comment |
---|---|---|---|---|---|
Capillary | DB-5 | 100. | 1017.40 | Harangi, 2003 | 60. m/0.32 mm/1. μm, He |
Capillary | DB-5 | 100. | 1020.06 | Harangi, 2003 | 60. m/0.32 mm/1. μm, He |
Capillary | DB-5 | 120. | 1027.05 | Harangi, 2003 | 60. m/0.32 mm/1. μm, He |
Capillary | DB-5 | 120. | 1027.35 | Harangi, 2003 | 60. m/0.32 mm/1. μm, He |
Capillary | SE-30 | 160. | 1013.8 | Santiuste, Harangi, et al., 2003 | |
Capillary | HP-5 | 120. | 1022.5 | Santiuste, Harangi, et al., 2003 | |
Capillary | HP-5 | 120. | 1022.5 | Santiuste J.M. and Takacs J.M., 2003 | 60. m/0.25 mm/0.25 μm, N2 |
Capillary | HP-5 | 140. | 1036.2 | Santiuste J.M. and Takacs J.M., 2003 | 60. m/0.25 mm/0.25 μm, N2 |
Capillary | SPB-1 | 140. | 1009. | Vezzani, Bertocchi, et al., 1998 | 30. m/0.32 mm/0.25 μm |
Capillary | DB-5 | 110. | 1024.65 | Gerbino, Garbarino, et al., 1996 | 30. m/0.53 mm/1.5 μm, N2 |
Capillary | DB-5 | 70. | 1004.07 | Gerbino, Garbarino, et al., 1996 | 30. m/0.53 mm/1.5 μm, N2 |
Capillary | DB-5 | 90. | 1013.30 | Gerbino, Garbarino, et al., 1996 | 30. m/0.53 mm/1.5 μm, N2 |
Capillary | SE-30 | 0. | 985. | Spieksma, Luijk, et al., 1994 | |
Capillary | SE-30 | 160. | 964. | Evans and Haken, 1989 | Column length: 25. m; Column diameter: 0.32 mm |
Capillary | SE-30 | 160. | 1016. | Tarjan, Nyiredy, et al., 1989 | |
Capillary | SE-30 | 120. | 964. | Haken and Korhonene, 1983 | N2; Column length: 25. m; Column diameter: 0.22 mm |
Capillary | SE-30 | 140. | 1013. | Haken and Korhonene, 1983 | N2; Column length: 25. m; Column diameter: 0.22 mm |
Capillary | SE-30 | 160. | 1016. | Haken and Korhonene, 1983 | N2; Column length: 25. m; Column diameter: 0.22 mm |
Packed | Apiezon L | 130. | 1058. | Wehrli and Kováts, 1959 | Celite; Column length: 2.25 m |

Kovats' RI, non-polar column, temperature ramp

Column type | Active phase | I | Reference | Comment |
---|---|---|---|---|
Capillary | OV-101 | 1000. | Yamaguchi and Shibamoto, 1981 | N2, 2. K/min; Column length: 70. m; Column diameter: 0.28 mm; Tstart: 80. C; Tend: 200. C |
Capillary | OV-101 | 997. | Yamaguchi and Shibamoto, 1981 | N2, 2. K/min; Column length: 70. m; Column diameter: 0.28 mm; Tstart: 80. C; Tend: 200. C |

Kovats' RI, polar column, isothermal

Column type | Active phase | Temperature (C) | I | Reference | Comment |
---|---|---|---|---|---|
Capillary | ZB-Wax | 120. | 1455.4 | Pérez-Parajón, Santiuste, et al., 2004 | 60. m/0.25 mm/0.25 μm |
Capillary | ZB-Wax | 140. | 1474.1 | Pérez-Parajón, Santiuste, et al., 2004 | 60. m/0.25 mm/0.25 μm |
Capillary | Carbowax 20M | 160. | 1415. | Evans and Haken, 1989 | Column length: 22. m; Column diameter: 0.3 mm |
Capillary | Carbowax 20M | 140. | 1415. | Haken and Korhonene, 1983 | N2; Column length: 22. m; Column diameter: 0.3 mm |
Capillary | Carbowax 20M | 160. | 1434. | Haken and Korhonene, 1983 | N2; Column length: 22. m; Column diameter: 0.3 mm |

Kovats' RI, polar column, temperature ramp

Column type | Active phase | I | Reference | Comment |
---|---|---|---|---|
Capillary | Carbowax 20M | 1409. | Yamaguchi and Shibamoto, 1981 | N2, 2. K/min; Column length: 70. m; Column diameter: 0.28 mm; Tstart: 80. C; Tend: 200. C |
Capillary | Carbowax 20M | 1414. | Yamaguchi and Shibamoto, 1981 | N2, 2. K/min; Column length: 70. m; Column diameter: 0.28 mm; Tstart: 80. C; Tend: 200. C |

Van Den Dool and Kratz RI, non-polar column, temperature ramp

Column type | Active phase | I | Reference | Comment |
---|---|---|---|---|
Capillary | SPB-5 | 1022. | Engel and Ratel, 2007 | 60. m/0.32 mm/1. μm, 40. C @ 2. min, 3. K/min, 230. C @ 10. min |
Capillary | DB-5 | 1014.97 | Harangi, 2003 | 60. m/0.32 mm/1. μm, He, 60. C @ 2.8 min, 3. K/min; Tend: 180. C |
Capillary | DB-5 | 1015.34 | Harangi, 2003 | 60. m/0.32 mm/1. μm, He, 60. C @ 2.8 min, 3. K/min; Tend: 180. C |
Capillary | DB-5 | 1017.77 | Harangi, 2003 | 60. m/0.32 mm/1. μm, He, 60. C @ 2.8 min, 4. K/min; Tend: 180. C |
Capillary | DB-5 | 1018.92 | Harangi, 2003 | 60. m/0.32 mm/1. μm, He, 60. C @ 2.8 min, 4. K/min; Tend: 180. C |
Capillary | DB-1 | 975.4 | Sun and Stremple, 2003 | 30. m/0.25 mm/0.25 μm, He, 3. K/min; Tstart: 40. C; Tend: 325. C |
Capillary | DB-5 | 1020.9 | Xu, van Stee, et al., 2003 | 30. m/0.25 mm/1. μm, He, 2.5 K/min; Tstart: 50. C; Tend: 200. C |
Capillary | Ultra-1 | 986.21 | Richmond and Pombo-Villar, 1997 | 25. m/0.32 mm/0.52 μm, 15. K/min, 320. C @ 10. min; Tstart: 35. C |
Capillary | OV-1 | 985.1 | Gautzsch and Zinn, 1996 | 8. K/min; Tstart: 35. C; Tend: 300. C |
Capillary | DB-5 | 1002.37 | Gerbino, Garbarino, et al., 1996 | 30. m/0.53 mm/1.5 μm, N2, 2. K/min; Tstart: 50. C |
Capillary | DB-5 | 997.98 | Gerbino, Garbarino, et al., 1996 | 30. m/0.53 mm/1.5 μm, N2, 2. K/min; Tstart: 50. C |
Capillary | DB-5 | 999.87 | Gerbino, Garbarino, et al., 1996 | 30. m/0.53 mm/1.5 μm, N2, 2. K/min; Tstart: 50. C |
Capillary | DB-1 | 1014. | Gerbino and Castello, 1995 | 30. m/0.235 mm/0.25 μm, N2, 100. C @ 0. min, 10. K/min |
Capillary | DB-1 | 1002. | Gerbino and Castello, 1995 | 30. m/0.235 mm/0.25 μm, N2, 100. C @ 0. min, 5. K/min |
Capillary | DB-1 | 990. | Gerbino and Castello, 1995 | 30. m/0.235 mm/0.25 μm, N2, 50. C @ 0. min, 10. K/min |
Capillary | DB-1 | 985. | Gerbino and Castello, 1995 | 30. m/0.235 mm/0.25 μm, N2, 50. C @ 0. min, 5. K/min |
Capillary | Petrocol DH | 982. | White, Hackett, et al., 1992 | 100. m/0.25 mm/0.5 μm, He, 1. K/min; Tstart: 30. C; Tend: 220. C |

Van Den Dool and Kratz RI, non-polar column, custom temperature program

Column type | Active phase | I | Reference | Comment |
---|---|---|---|---|
Packed | SE-30 | 1025. | Peng, Ding, et al., 1988 | Supelcoport; Chromosorb; Column length: 3.05 m; Program: 40C(5min) => 10C/min => 200C or 250C (60min) |

Van Den Dool and Kratz RI, polar column, temperature ramp

Column type | Active phase | I | Reference | Comment |
---|---|---|---|---|
Capillary | DB-Wax | 1445.33 | Gerbino and Castello, 1995 | 30. m/0.235 mm/0.5 μm, N2, 10. K/min; Tstart: 100. C |
Capillary | DB-Wax | 1438.32 | Gerbino and Castello, 1995 | 30. m/0.235 mm/0.5 μm, N2, 5. K/min; Tstart: 100. C |
Capillary | DB-Wax | 1417.70 | Gerbino and Castello, 1995 | 30. m/0.235 mm/0.5 μm, N2, 5. K/min; Tstart: 50. C |
Capillary | Supelcowax-10 | 1446. | Chung and Cadwallader, 1993 | 60. m/0.25 mm/0.25 μm, He, 40. C @ 5. min, 2. K/min, 195. C @ 40. min |
Capillary | Supelcowax-10 | 1451. | Vejaphan, Hsieh, et al., 1988 | 60. m/0.25 mm/0.25 μm, 40. C @ 5. min, 2. K/min, 175. C @ 20. min |
Capillary | Supelcowax-10 | 1453. | Vejaphan, Hsieh, et al., 1988 | 60. m/0.25 mm/0.25 μm, 40. C @ 5. min, 2. K/min, 175. C @ 20. min |

Normal alkane RI, non-polar column, isothermal

Column type | Active phase | Temperature (C) | I | Reference | Comment |
---|---|---|---|---|---|
Capillary | E-301 | 100. | 1004. | Bermejo, Moinelo, et al., 1980 | N2; Column length: 50. m; Column diameter: 0.25 mm |
Capillary | Squalane | 100. | 997. | Bermejo, Moinelo, et al., 1980 | N2; Column length: 50. m; Column diameter: 0.25 mm |

Normal alkane RI, non-polar column, temperature ramp

Column type | Active phase | I | Reference | Comment |
---|---|---|---|---|
Capillary | HP-5 MS | 1007. | Kotowska, Zalikowski, et al., 2012 | 30. m/0.25 mm/0.25 μm, Helium, 35. C @ 5. min, 3. K/min, 300. C @ 15. min |
Capillary | HP-5 | 1005. | Zenkevich, Moeder, et al., 2004 | 30. m/0.25 mm/0.25 μm, Helium, 50. C @ 3. min, 3. K/min, 280. C @ 20. min |
Capillary | SE-54 | 1002. | Harland, Cumming, et al., 1986 | He, 50. C @ 2. min, 8. K/min, 250. C @ 12. min; Column length: 25. m; Column diameter: 0.32 mm |

Normal alkane RI, non-polar column, custom temperature program

Column type | Active phase | I | Reference | Comment |
---|---|---|---|---|
Capillary | HP-5 MS | 1011. | Kotowska, Zalikowski, et al., 2012 | 30. m/0.25 mm/0.25 μm, Helium; Program: not specified |
Capillary | Polydimethyl siloxane with 5 % Ph groups | 1014. | Robinson, Adams, et al., 2012 | Program: not specified |
Capillary | Polydimethyl siloxane with 5 % Ph groups | 1022. | Robinson, Adams, et al., 2012 | Program: not specified |
Capillary | Methyl Silicone | 964. | Yu and Zazhi, 2005 | Program: not specified |
Capillary | CP Sil 2 | 988. | Fuhrer, Deissler, et al., 1997 | 55. m/0.25 mm/0.25 μm, N2; Program: 40C(3min) => 20C/min => 80C => 2C/min => 240C(45min) |
Capillary | Polydimethyl siloxanes | 1005. | Zenkevich and Chupalov, 1996 | Program: not specified |
Capillary | DB-5 | 1047. | Sorimachi, Tanabe, et al., 1995 | He; Column length: 30. m; Program: not specified |
Capillary | DB-1 | 986. | Ciccioli, Cecinato, et al., 1994 | 60. m/0.32 mm/0.25 μm; Program: not specified |
Capillary | SPB-1 | 982. | Vezzani, Moretti, et al., 1994 | Column length: 30. m; Column diameter: 0.32 mm; Program: not specified |
Capillary | PTE-5 | 1045. | Nakano, Fujimori, et al., 1992 | 25. m/0.20 mm/0.33 μm; Program: 50 0C (2 min) 30 0C/min -> 200 0C 8 0C/min -> 280 0C (10 min) |
Capillary | Ultra-2 | 1021. | Nakano, Fujimori, et al., 1992 | 25. m/0.20 mm/0.33 μm; Program: 50 0C (2 min) 30 0C/min -> 200 0C 8 0C/min -> 280 0C (10 min) |
Capillary | OV-1 | 981. | Waggott and Davies, 1984 | Hydrogen; Column length: 50. m; Column diameter: 0.32 mm; Program: not specified |
Capillary | OV-1, SE-30, Methyl silicone, SP-2100, OV-101, DB-1, etc. | 981. | Waggott and Davies, 1984 | Hydrogen; Column length: 50. m; Column diameter: 0.32 mm; Program: not specified |
Capillary | OV-1, SE-30, Methyl silicone, SP-2100, OV-101, DB-1, etc. | 981. | Waggott and Davies, 1984 | Hydrogen; Column length: 50. m; Column diameter: 0.32 mm; Program: not specified |
Capillary | OV-1, SE-30, Methyl silicone, SP-2100, OV-101, DB-1, etc. | 982. | Waggott and Davies, 1984 | Hydrogen; Column length: 50. m; Column diameter: 0.32 mm; Program: not specified |

Normal alkane RI, polar column, temperature ramp

Column type | Active phase | I | Reference | Comment |
---|---|---|---|---|
Capillary | DB-Wax | 1477. | Rochat, Egger, et al., 2009 | 30. m/0.25 mm/0.25 μm, Helium, 60. C @ 3. min, 8. K/min, 200. C @ 9.5 min |

Normal alkane RI, polar column, custom temperature program

Column type | Active phase | I | Reference | Comment |
---|---|---|---|---|
Capillary | DB-Wax | 1418. | Caldentey, Daria Fumi, et al., 1998 | 30. m/0.25 mm/0.25 μm, He; Program: 25C(8min) => 4C/min => 60C => 6C/min => 160C => 20C/min => 200C |

Lee's RI, non-polar column, temperature ramp

Column type | Active phase | I | Reference | Comment |
---|---|---|---|---|
Capillary | HP5-MS | 162. | Vrana, Paschke, et al., 2005 | 30. m/0.25 mm/0.25 μm, Helium, 50. C @ 5. min, 5. K/min, 280. C @ 10. min |
Capillary | DB-5 | 160.4 | Donnelly, Abdel-Hamid, et al., 1993 | 30. m/0.32 mm/0.25 μm, He, 40. C @ 3. min, 8. K/min, 285. C @ 29.5 min |

References

Schlosser, Marzi, et al., 2001
Schlosser, M.; Marzi, E.; Cottet, F.; Buker, H.H.; Nibbering, N.M.M.,
The acidity of chloro-substituted benzenes: A comparison of gas phase, ab initio, and kinetic data,
Chem. Eur. J., 2001, 7, 16, 3511-3516, https://doi.org/10.1002/1521-3765(20010817)7:16<3511::AID-CHEM3511>3.0.CO;2-U
. [all data]
Godnev and Sverdlin, 1961
Godnev, I.N.; Sverdlin, A.S.,
Equilibrium and dichlorobenzene isomer (Corrections),
Russ. J. Phys. Chem. (Engl. Transl.), 1961, 35, 231-232. [all data]
Olesik, Baer, et al., 1986
Olesik, S.; Baer, T.; Morrow, J.C.,
Dissociation rates of energy-selected dichloro- and dibromobenzene ions,
J. Phys. Chem., 1986, 90, 3563. [all data]
Ruscic, Klasinc, et al., 1981
Ruscic, B.; Klasinc, L.; Wolf, A.; Knop, J.V.,
Photoelectron spectra of and Ab initio calculations on chlorobenzenes. 1. Chlorobenzene and dichlorobenzenes,
J. Phys. Chem., 1981, 85, 1486. [all data]
Kimura, Katsumata, et al., 1981
Kimura, K.; Katsumata, S.; Achiba, Y.; Yamazaki, T.; Iwata, S.,
Ionization energies, Ab initio assignments, and valence electronic structure for 200 molecules
in Handbook of HeI Photoelectron Spectra of Fundamental Organic Compounds, Japan Scientific Soc. Press, Tokyo, 1981. [all data]
Maier and Marthaler, 1978
Maier, J.P.; Marthaler, O.,
Emission spectra of the radical cations of 1,3-dichlorobenzene, 1,4-dichlorobenzene and 1,3,5-trichlorobenzene in the gas phase,
Chem. Phys., 1978, 32, 419. [all data]
Lias and Ausloos, 1978
Lias, S.G.; Ausloos, P.J.,
eIonization energies of organic compounds by equilibrium measurements,
J. Am. Chem. Soc., 1978, 100, 6027. [all data]
Watanabe, Nakayama, et al., 1962
Watanabe, K.; Nakayama, T.; Mottl, J.,
Ionization potentials of some molecules,
J. Quant. Spectry. Radiative Transfer, 1962, 2, 369. [all data]
Fujisawa, Oonishi, et al., 1991
Fujisawa, S.; Oonishi, I.; Masuda, S.; Ohno, K.; Harada, Y.,
Penning ionization electron spectroscopy of dichlorobenzenes,
J. Phys. Chem., 1991, 95, 4250. [all data]
Streets and Ceasar, 1973
Streets, D.G.; Ceasar, G.P.,
Inductive mesomeric effects on the π orbitals of halobenzenes,
Mol. Phys., 1973, 26, 1037. [all data]
Brown, 1970
Brown, P.,
Kinetic studies in mass spectrometry-IV. The [M - Cl] reaction in substituted chlorobenzenes and the question of molecular ion isomerization,
Org. Mass Spectrom., 1970, 3, 639. [all data]