iso-Propyl nitrite
- Formula: C3H7NO2
- Molecular weight: 89.0932
- IUPAC Standard InChIKey: SKRDXYBATCVEMS-UHFFFAOYSA-N
- CAS Registry Number: 541-42-4
- Chemical structure:
View 3d structure (requires JavaScript / HTML 5) - Permanent link for this species. Use this link for bookmarking this species for future reference.

Gas phase thermochemistry data

Data compiled by: Hussein Y. Afeefy, Joel F. Liebman, and Stephen E. Stein
Quantity | Value | Units | Method | Reference | Comment |
---|---|---|---|---|---|
ΔfH°gas | -133. ± 4.2 | kJ/mol | Ccb | Batt, Christie, et al., 1974 |

Condensed phase thermochemistry data

Data compiled by: Hussein Y. Afeefy, Joel F. Liebman, and Stephen E. Stein
Quantity | Value | Units | Method | Reference | Comment |
---|---|---|---|---|---|
ΔfH°liquid | -164. | kJ/mol | Ccb | Batt, Christie, et al., 1974 | |
Quantity | Value | Units | Method | Reference | Comment |
ΔcH°liquid | -2017. ± 0.8 | kJ/mol | Ccb | Batt, Christie, et al., 1974 |

Phase change data

Data compiled as indicated in comments:
BS - Robert L. Brown and Stephen E. Stein
TRC - Thermodynamics Research Center, NIST Boulder Laboratories, Chris Muzny director
ALS - Hussein Y. Afeefy, Joel F. Liebman, and Stephen E. Stein
AC - William E. Acree, Jr., James S. Chickos
Quantity | Value | Units | Method | Reference | Comment |
---|---|---|---|---|---|
Tboil | 318. | K | N/A | Frinton Laboratories Inc., 1986 | BS |
Tboil | 313.1 | K | N/A | Kornblum, Smiley, et al., 1955 | Uncertainty assigned by TRC = 0.3 K; TRC |
Tboil | 313.3 | K | N/A | Lecat, 1947 | Uncertainty assigned by TRC = 0.5 K; TRC |
Quantity | Value | Units | Method | Reference | Comment |
ΔvapH° | 31. | kJ/mol | E | Batt, Christie, et al., 1974 | ALS |
Enthalpy of vaporization
ΔvapH (kJ/mol) | Temperature (K) | Method | Reference | Comment |
---|---|---|---|---|
26.0 | 260. | A | Stephenson and Malanowski, 1987 | Based on data from 253. to 268. K. See also Thompson and Dainton, 1937.; AC |

Gas phase ion energetics data

Data evaluated as indicated in comments:
HL - Edward P. Hunter and Sharon G. Lias
Data compiled as indicated in comments:
RDSH - Henry M. Rosenstock, Keith Draxl, Bruce W. Steiner, and John T. Herron
Quantity | Value | Units | Method | Reference | Comment |
---|---|---|---|---|---|
Proton affinity (review) | 845.5 | kJ/mol | N/A | Hunter and Lias, 1998 | HL |
Quantity | Value | Units | Method | Reference | Comment |
Gas basicity | 813.0 | kJ/mol | N/A | Hunter and Lias, 1998 | HL |
Ionization energy determinations
IE (eV) | Method | Reference | Comment |
---|---|---|---|
10.23 ± 0.01 | PE | Dewar, Shanshal, et al., 1969 | RDSH |

References

Batt, Christie, et al., 1974
Batt, L.; Christie, K.; Milne, R.T.; Summers, A.J.,
Heats of formation of C1-C4 alkyl nitrites (RONO) and their RO-NO bond dissociation energies,
Int. J. Chem. Kinet., 1974, 6, 877-886. [all data]
Frinton Laboratories Inc., 1986
Frinton Laboratories Inc.,
Catalog Number 11, Frinton Laboratories Inc., Vineland, NJ, 1986, 99. [all data]
Kornblum, Smiley, et al., 1955
Kornblum, N.; Smiley, R.A.; Ungnade, H.E.; White, A.M.; Taub, B.,
The reaction of silver nitrite with secondary and tertiary alkyl halides,
J. Am. Chem. Soc., 1955, 77, 5528-33. [all data]
Lecat, 1947
Lecat, M.,
Orthobaric Azeotropes of Sulfides,
Bull. Cl. Sci., Acad. R. Belg., 1947, 33, 160-82. [all data]
Stephenson and Malanowski, 1987
Stephenson, Richard M.; Malanowski, Stanislaw,
Handbook of the Thermodynamics of Organic Compounds, 1987, https://doi.org/10.1007/978-94-009-3173-2
. [all data]
Thompson and Dainton, 1937
Thompson, H.W.; Dainton, F.S.,
The photochemistry of alkyl nitrites. III,
Trans. Faraday Soc., 1937, 33, 1546, https://doi.org/10.1039/tf9373301546
. [all data]
Hunter and Lias, 1998
Hunter, E.P.; Lias, S.G.,
Evaluated Gas Phase Basicities and Proton Affinities of Molecules: An Update,
J. Phys. Chem. Ref. Data, 1998, 27, 3, 413-656, https://doi.org/10.1063/1.556018
. [all data]
Dewar, Shanshal, et al., 1969
Dewar, M.J.S.; Shanshal, M.; Worley, S.D.,
Calculated and observed ionization potentials gf nitroalkanes and of nitrous and nitric acids and esters. Extension of the MINDO method to nitrogen-oxygen compounds,
J. Am. Chem. Soc., 1969, 91, 3590. [all data]