3-Cyclobutene-1,2-dione, 3,4-bis(methylthio)-
- Formula: C6H6O2S2
- Molecular weight: 174.241
- IUPAC Standard InChIKey: VUQDDHLQBBTHIC-UHFFFAOYSA-N
- CAS Registry Number: 54131-97-4
- Chemical structure:
View 3d structure (requires JavaScript / HTML 5) - Permanent link for this species. Use this link for bookmarking this species for future reference.

Gas phase ion energetics data

Data compiled by: Sharon G. Lias, Rhoda D. Levin, and Sherif A. Kafafi
Ionization energy determinations
IE (eV) | Method | Reference | Comment |
---|---|---|---|
8.49 | PE | Bock, Ried, et al., 1981 | Vertical value |
8.18 | PE | Gleiter, Schang, et al., 1978 | Vertical value |

References

Bock, Ried, et al., 1981
Bock, H.; Ried, W.; Stein, U.,
Analyse und optimierung von gasphasen-reaktionen, 19. Pyrolyse von cyclobuten-1,2-dionen zu acetylenen,
Chem. Ber., 1981, 114, 673. [all data]
Gleiter, Schang, et al., 1978
Gleiter, R.; Schang, P.; Seitz, G.,
Photoelectron spectra of cyclobutene-1,2-dione derivatives,
Chem. Phys. Lett., 1978, 55, 144. [all data]