Tryptophan
- Formula: C11H12N2O2
- Molecular weight: 204.2252
- IUPAC Standard InChIKey: QIVBCDIJIAJPQS-UHFFFAOYSA-N
- CAS Registry Number: 54-12-6
- Chemical structure:
View 3d structure (requires JavaScript / HTML 5) - Stereoisomers:
- Other names: DL-Tryptophan; DL-α-Amino-3-indolepropionic acid; DL-Trytophan; DL-Trytophane; Racemic Tryptophan; Tryptophan, DL-; Tryptophane; (.+/-.)-Tryptophan; NSC 13118; DL-Tryptophane

Reaction thermochemistry data

Data compiled as indicated in comments:
B - John E. Bartmess
RCD - Robert C. Dunbar
Individual Reactions
By formula: C11H11N2O2- + H+ = C11H12N2O2
Quantity | Value | Units | Method | Reference | Comment |
---|---|---|---|---|---|
ΔrH° | 1421. ± 9.2 | kJ/mol | CIDC | Jones, Bernier, et al., 2007 | gas phase; B |
ΔrH° | 1409. ± 13. | kJ/mol | G+TS | O'Hair, Bowie, et al., 1992 | gas phase; B |
Quantity | Value | Units | Method | Reference | Comment |
ΔrG° | 1380. ± 13. | kJ/mol | CIDC | O'Hair, Bowie, et al., 1992 | gas phase; B |
By formula: Na+ + C11H12N2O2 = (Na+ • C11H12N2O2)
Quantity | Value | Units | Method | Reference | Comment |
---|---|---|---|---|---|
ΔrH° | 205. ± 13. | kJ/mol | IMRE | Gapeev and Dunbar, 2003 | Anchor glycine=38.5+-2.6; RCD |
ΔrH° | 210. | kJ/mol | CIDC | Kish, Ohanessian, et al., 2003 | Anchor alanine=39.89; RCD |

Gas phase ion energetics data

Data compiled as indicated in comments:
B - John E. Bartmess
RDSH - Henry M. Rosenstock, Keith Draxl, Bruce W. Steiner, and John T. Herron
Ionization energy determinations
IE (eV) | Method | Reference | Comment |
---|---|---|---|
8.43 | CTS | Slifkin and Allison, 1967 | RDSH |
≤7.5 | EI | Akopyan and Loginov, 1967 | RDSH |
De-protonation reactions
By formula: C11H11N2O2- + H+ = C11H12N2O2
Quantity | Value | Units | Method | Reference | Comment |
---|---|---|---|---|---|
ΔrH° | 1421. ± 9.2 | kJ/mol | CIDC | Jones, Bernier, et al., 2007 | gas phase; B |
ΔrH° | 1409. ± 13. | kJ/mol | G+TS | O'Hair, Bowie, et al., 1992 | gas phase; B |
Quantity | Value | Units | Method | Reference | Comment |
ΔrG° | 1380. ± 13. | kJ/mol | CIDC | O'Hair, Bowie, et al., 1992 | gas phase; B |

Ion clustering data

Data compiled by: Robert C. Dunbar
Clustering reactions
By formula: Na+ + C11H12N2O2 = (Na+ • C11H12N2O2)
Quantity | Value | Units | Method | Reference | Comment |
---|---|---|---|---|---|
ΔrH° | 205. ± 13. | kJ/mol | IMRE | Gapeev and Dunbar, 2003 | Anchor glycine=38.5+-2.6 |
ΔrH° | 210. | kJ/mol | CIDC | Kish, Ohanessian, et al., 2003 | Anchor alanine=39.89 |

References

Jones, Bernier, et al., 2007
Jones, C.M.; Bernier, M.; Carson, E.; Colyer, K.E.; Metz, R.; Pawlow, A.; Wischow, E.D.; Webb, I.; Andriole, E.J.; Poutsma, J.C.,
Gas-phase Acities of the 20 Protein Amino Acids,
Int. J. Mass Spectrom., 2007, 267, 1-3, 54-62, https://doi.org/10.1016/j.ijms.2007.02.018
. [all data]
O'Hair, Bowie, et al., 1992
O'Hair, R.J.; Bowie, J.H.; Gronert, S.,
Gas Phase Acidity of the alpha-Amino Acids,
Int. J. Mass Spectrom. Ion Proc., 1992, 117, 23, https://doi.org/10.1016/0168-1176(92)80083-D
. [all data]
Gapeev and Dunbar, 2003
Gapeev, A.; Dunbar, R.C.,
Na+ Affinities of Gas-Phase Amino Acids by Ligand Exchange Equilibrium,
Int. J. Mass Spectrom., 2003, 228, 2-3, 825, https://doi.org/10.1016/S1387-3806(03)00242-2
. [all data]
Kish, Ohanessian, et al., 2003
Kish, M.M.; Ohanessian, G.; Wesdemiotis, C.,
The Na+ affinities of a-amino acids: side-chain substituent effects,
Int. J. Mass Spectrom., 2003, 227, 3, 509, https://doi.org/10.1016/S1387-3806(03)00082-4
. [all data]
Slifkin and Allison, 1967
Slifkin, M.A.; Allison, A.C.,
Measurement of ionization potentials from contact charge transfer spectra,
Nature, 1967, 215, 949. [all data]
Akopyan and Loginov, 1967
Akopyan, M.E.; Loginov, Yy.V.,
Mass-spectrometric study of the phoionization of free α-aminoacids,
High Energy Chem., 1967, 1, 83, In original 97. [all data]